Hi I'm getting following error while compiling libguestfs-1.26.1... CCLD guestfish guestfish-progress.o: In function `progress_bar_init': /home/ubuntu/libguestfs-1.26.1/fish/progress.c:123: undefined reference to `tgetent' guestfish-progress.o: In function `progress_bar_set': /home/ubuntu/libguestfs-1.26.1/fish/progress.c:282: undefined reference to `tgetnum' /home/ubuntu/libguestfs-1.26.1/fish/progress.c:297: undefined reference to `UP' guestfish-progress.o: In function `fprintf': /usr/include/powerpc-linux-gnu/bits/stdio2.h:97: undefined reference to `UP' collect2: error: ld returned 1 exit status make[3]: *** [guestfish] Error 1 make[3]: Leaving directory `/home/ubuntu/libguestfs-1.26.1/fish' make[2]: *** [all] Error 2 make[2]: Leaving directory `/home/ubuntu/libguestfs-1.26.1/fish' make[1]: *** [all-recursive] Error 1 make[1]: Leaving directory `/home/ubuntu/libguestfs-1.26.1' make: *** [all] Error 2 I was able to compile it yesterday but when i formatted my hard disk and tried to install it again,it started showing the above error. Please help regarding this. Thanks Abhishek Jain
On Thu, May 29, 2014 at 05:05:30PM +0530, abhishek jain wrote:
Hi
I'm getting following error while compiling libguestfs-1.26.1...
CCLD guestfish guestfish-progress.o: In function `progress_bar_init': /home/ubuntu/libguestfs-1.26.1/fish/progress.c:123: undefined reference to `tgetent' guestfish-progress.o: In function `progress_bar_set': /home/ubuntu/libguestfs-1.26.1/fish/progress.c:282: undefined reference to `tgetnum' /home/ubuntu/libguestfs-1.26.1/fish/progress.c:297: undefined reference to `UP' guestfish-progress.o: In function `fprintf': /usr/include/powerpc-linux-gnu/bits/stdio2.h:97: undefined reference to `UP' collect2: error: ld returned 1 exit status
These symbols are provided by 'libtinfo' which is part of ncurses. So you'll probably need to install that library, eg: yum install ncurses-devel apt-get install libtinfo-dev Rich. -- Richard Jones, Virtualization Group, Red Hat http://people.redhat.com/~rjones Read my programming and virtualization blog: http://rwmj.wordpress.com virt-top is 'top' for virtual machines. Tiny program with many powerful monitoring features, net stats, disk stats, logging, etc. http://people.redhat.com/~rjones/virt-top
Hi Rich I'm sure that this is some dependeny issue. libtinfo-dev is already installed. I have install libcunit1-ncurses-dev,libncurses5 However the package ncurses-devel is nor present in ubuntu. apt-cache search ncurses-devel returns nothing Thanks for the quick reply On Thu, May 29, 2014 at 5:18 PM, Richard W.M. Jones <rjones@redhat.com> wrote:
On Thu, May 29, 2014 at 05:05:30PM +0530, abhishek jain wrote:
Hi
I'm getting following error while compiling libguestfs-1.26.1...
CCLD guestfish guestfish-progress.o: In function `progress_bar_init': /home/ubuntu/libguestfs-1.26.1/fish/progress.c:123: undefined reference to `tgetent' guestfish-progress.o: In function `progress_bar_set': /home/ubuntu/libguestfs-1.26.1/fish/progress.c:282: undefined reference to `tgetnum' /home/ubuntu/libguestfs-1.26.1/fish/progress.c:297: undefined reference to `UP' guestfish-progress.o: In function `fprintf': /usr/include/powerpc-linux-gnu/bits/stdio2.h:97: undefined reference to `UP' collect2: error: ld returned 1 exit status
These symbols are provided by 'libtinfo' which is part of ncurses.
So you'll probably need to install that library, eg:
yum install ncurses-devel apt-get install libtinfo-dev
Rich.
-- Richard Jones, Virtualization Group, Red Hat http://people.redhat.com/~rjones Read my programming and virtualization blog: http://rwmj.wordpress.com virt-top is 'top' for virtual machines. Tiny program with many powerful monitoring features, net stats, disk stats, logging, etc. http://people.redhat.com/~rjones/virt-top
On Thu, May 29, 2014 at 05:31:20PM +0530, abhishek jain wrote:
Hi Rich
I'm sure that this is some dependeny issue. libtinfo-dev is already installed.
Did you rerun configure after installing the package? This is necessary because the autoconf script changes one of the variable definitions depending on what is installed. If in doubt this should fix things: sudo apt-get install libtinfo-dev rm -f config.cache ./configure make clean make FYI on my Ubuntu 13.10 machine: $ nm -D /usr/lib/x86_64-linux-gnu/libtinfo.so | grep tgetent 00000000000112c0 T tgetent $ dpkg -S /usr/lib/x86_64-linux-gnu/libtinfo.so libtinfo-dev:amd64: /usr/lib/x86_64-linux-gnu/libtinfo.so Rich. -- Richard Jones, Virtualization Group, Red Hat http://people.redhat.com/~rjones Read my programming and virtualization blog: http://rwmj.wordpress.com virt-top is 'top' for virtual machines. Tiny program with many powerful monitoring features, net stats, disk stats, logging, etc. http://people.redhat.com/~rjones/virt-top
Hi Rich I using ubuntu 13.10 with powerpc arch. I tried the above stepss and below are the output of the related commands.. nm -D /usr/lib/powerpc-linux-gnu/libtinfo.so | grep tgetent 0000def0 T tgetent ubuntu@t4240-ubuntu1310:~$ dpkg -S /usr/lib/powerpc-linux-gnu/libtinfo.so libtinfo-dev:powerpc: /usr/lib/powerpc-linux-gnu/libtinfo.so However I'm not able to perform rm -f config.cache as there is no config.cache file Thanks for the wonderful support. On Thu, May 29, 2014 at 6:27 PM, Richard W.M. Jones <rjones@redhat.com> wrote:
On Thu, May 29, 2014 at 05:31:20PM +0530, abhishek jain wrote:
Hi Rich
I'm sure that this is some dependeny issue. libtinfo-dev is already installed.
Did you rerun configure after installing the package? This is necessary because the autoconf script changes one of the variable definitions depending on what is installed.
If in doubt this should fix things:
sudo apt-get install libtinfo-dev rm -f config.cache ./configure make clean make
FYI on my Ubuntu 13.10 machine:
$ nm -D /usr/lib/x86_64-linux-gnu/libtinfo.so | grep tgetent 00000000000112c0 T tgetent $ dpkg -S /usr/lib/x86_64-linux-gnu/libtinfo.so libtinfo-dev:amd64: /usr/lib/x86_64-linux-gnu/libtinfo.so
Rich.
-- Richard Jones, Virtualization Group, Red Hat http://people.redhat.com/~rjones Read my programming and virtualization blog: http://rwmj.wordpress.com virt-top is 'top' for virtual machines. Tiny program with many powerful monitoring features, net stats, disk stats, logging, etc. http://people.redhat.com/~rjones/virt-top
On Thu, May 29, 2014 at 08:31:06PM +0530, abhishek jain wrote:
Hi Rich
I using ubuntu 13.10 with powerpc arch. I tried the above stepss and below are the output of the related commands..
nm -D /usr/lib/powerpc-linux-gnu/libtinfo.so | grep tgetent 0000def0 T tgetent ubuntu@t4240-ubuntu1310:~$ dpkg -S /usr/lib/powerpc-linux-gnu/libtinfo.so libtinfo-dev:powerpc: /usr/lib/powerpc-linux-gnu/libtinfo.so
However I'm not able to perform rm -f config.cache as there is no config.cache file
The config.cache file only exists if you are using the ./configure -C option. If it doesn't exist you can ignore it. Does it work after ./configure && make clean && make ? If not then please copy the entire output of that command into an email message. libguestfs works on ppc (64 bit anyway - I've not used ppc32 for a while), and this doesn't look like it would be a POWER-related problem in any case. Rich. -- Richard Jones, Virtualization Group, Red Hat http://people.redhat.com/~rjones Read my programming and virtualization blog: http://rwmj.wordpress.com virt-top is 'top' for virtual machines. Tiny program with many powerful monitoring features, net stats, disk stats, logging, etc. http://people.redhat.com/~rjones/virt-top
Hi Rich Yes Rich I have tried libguesftfs on powerpc and it was working fine.For some reason i had to format my hard disk and now when I'm again compiling it,I'm getting following error.... Below is the status of configure .. This is how we have configured the optional components for you today: Daemon .............................. yes Appliance ........................... yes QEMU ................................ /usr/bin/kvm guestfish and C-based virt tools .... yes FUSE filesystem ..................... yes GNU gettext for i18n ................ no OCaml bindings ...................... no OCaml-based virt tools .............. no Perl bindings ....................... yes Perl-based virt tools ............... no Python bindings ..................... yes Ruby bindings ....................... no Java bindings ....................... no Haskell bindings .................... no PHP bindings ........................ no Erlang bindings ..................... yes Lua bindings ........................ no Go bindings ......................... no gobject bindings .................... yes gobject introspection ............... no bash completion ..................... yes Below is the output of make... sudo make fatal: Not a git repository (or any of the parent directories): .git make all-recursive make[1]: Entering directory `/home/ubuntu/libguestfs-1.26.1' Making all in gnulib/lib make[2]: Entering directory `/home/ubuntu/libguestfs-1.26.1/gnulib/lib' GEN alloca.h GEN c++defs.h GEN warn-on-use.h GEN arg-nonnull.h GEN arpa/inet.h GEN configmake.h GEN dirent.h GEN fcntl.h GEN float.h GEN glob.h GEN inttypes.h GEN locale.h GEN netdb.h GEN signal.h GEN stdio.h GEN stdlib.h GEN string.h GEN sys/select.h GEN sys/socket.h GEN sys/stat.h GEN sys/time.h GEN sys/types.h GEN sys/uio.h GEN sys/wait.h GEN time.h GEN unistd.h GEN wchar.h GEN wctype.h make all-recursive make[3]: Entering directory `/home/ubuntu/libguestfs-1.26.1/gnulib/lib' make[4]: Entering directory `/home/ubuntu/libguestfs-1.26.1/gnulib/lib' CC accept4.lo CC allocator.lo CC areadlink.lo CC areadlinkat.lo CC argmatch.lo CC binary-io.lo CC bitrotate.lo CC c-ctype.lo CC c-strcasecmp.lo CC c-strncasecmp.lo CC careadlinkat.lo CC cloexec.lo CC close-stream.lo CC closeout.lo CC cycle-check.lo CC opendir-safer.lo CC dirname-lgpl.lo CC basename-lgpl.lo CC stripslash.lo CC dup3.lo CC exitfail.lo CC creat-safer.lo CC open-safer.lo CC fd-hook.lo CC filenamecat-lgpl.lo CC filevercmp.lo CC full-read.lo CC full-write.lo CC gettime.lo CC hash.lo CC hash-pjw.lo CC human.lo CC i-ring.lo CC localcharset.lo CC glthread/lock.lo CC malloca.lo CC openat-die.lo CC openat-safer.lo CC pipe2.lo CC quotearg.lo CC read-file.lo CC safe-read.lo CC safe-write.lo CC save-cwd.lo CC sockets.lo CC stat-time.lo CC strnlen1.lo CC sys_socket.lo CC tempname.lo CC glthread/threadlib.lo CC timespec.lo CC unistd.lo CC dup-safer.lo CC fd-safer.lo CC pipe-safer.lo CC utimens.lo CC wctype-h.lo CC xmalloc.lo CC xalloc-die.lo CC xsize.lo CC xstrtol.lo CC xstrtoul.lo CC xstrtol-error.lo CC xstrtoumax.lo CC xvasprintf.lo CC xasprintf.lo CC asnprintf.lo CC chdir-long.lo CC fcntl.lo CC float.lo CC fsusage.lo CC fts.lo CC futimens.lo CC glob.lo CC openat-proc.lo CC printf-args.lo CC printf-parse.lo CC strerror_r.lo CC vasnprintf.lo CC xstrtoll.lo CC xstrtoull.lo CCLD libgnu.la GEN charset.alias GEN ref-add.sed GEN ref-del.sed make[4]: Leaving directory `/home/ubuntu/libguestfs-1.26.1/gnulib/lib' make[3]: Leaving directory `/home/ubuntu/libguestfs-1.26.1/gnulib/lib' make[2]: Leaving directory `/home/ubuntu/libguestfs-1.26.1/gnulib/lib' Making all in gnulib/tests make[2]: Entering directory `/home/ubuntu/libguestfs-1.26.1/gnulib/tests' GEN arg-nonnull.h GEN c++defs.h GEN warn-on-use.h GEN sys/ioctl.h make all-recursive make[3]: Entering directory `/home/ubuntu/libguestfs-1.26.1/gnulib/tests' Making all in . make[4]: Entering directory `/home/ubuntu/libguestfs-1.26.1/gnulib/tests' make[4]: Nothing to be done for `all-am'. make[4]: Leaving directory `/home/ubuntu/libguestfs-1.26.1/gnulib/tests' make[3]: Leaving directory `/home/ubuntu/libguestfs-1.26.1/gnulib/tests' make[2]: Leaving directory `/home/ubuntu/libguestfs-1.26.1/gnulib/tests' Making all in tests/data make[2]: Entering directory `/home/ubuntu/libguestfs-1.26.1/tests/data' make[2]: Nothing to be done for `all'. make[2]: Leaving directory `/home/ubuntu/libguestfs-1.26.1/tests/data' Making all in generator make[2]: Entering directory `/home/ubuntu/libguestfs-1.26.1/generator' rm -f generator generator-t echo 'echo Warning: Install OCaml compiler in order to rebuild the generated files.' > generator-t chmod +x generator-t mv generator-t generator mkdir -p ../perl/lib/Sys mkdir -p ../ruby/ext/guestfs mkdir -p ../java/com/redhat/et/libguestfs mkdir -p ../csharp mkdir -p ../gobject/src mkdir -p ../gobject/include mkdir -p ../gobject/include/guestfs-gobject cd .. && /home/ubuntu/libguestfs-1.26.1/generator/generator Warning: Install OCaml compiler in order to rebuild the generated files. touch stamp-generator make[2]: Leaving directory `/home/ubuntu/libguestfs-1.26.1/generator' Making all in src make[2]: Entering directory `/home/ubuntu/libguestfs-1.26.1/src' make all-am make[3]: Entering directory `/home/ubuntu/libguestfs-1.26.1/src' CC libguestfs_la-actions-0.lo CC libguestfs_la-actions-1.lo CC libguestfs_la-actions-2.lo CC libguestfs_la-actions-3.lo CC libguestfs_la-actions-4.lo CC libguestfs_la-actions-5.lo CC libguestfs_la-actions-6.lo CC libguestfs_la-actions-support.lo CC libguestfs_la-actions-variants.lo CC libguestfs_la-alloc.lo CC libguestfs_la-appliance.lo CC libguestfs_la-bindtests.lo CC libguestfs_la-canonical-name.lo CC libguestfs_la-command.lo CC libguestfs_la-conn-socket.lo CC libguestfs_la-create.lo CC libguestfs_la-dbdump.lo CC libguestfs_la-drives.lo CC libguestfs_la-errors.lo CC libguestfs_la-event-string.lo CC libguestfs_la-events.lo CC libguestfs_la-file.lo CC libguestfs_la-filearch.lo CC libguestfs_la-fuse.lo CC libguestfs_la-guid.lo CC libguestfs_la-handle.lo CC libguestfs_la-info.lo CC libguestfs_la-inspect.lo CC libguestfs_la-inspect-apps.lo CC libguestfs_la-inspect-fs.lo CC libguestfs_la-inspect-fs-cd.lo CC libguestfs_la-inspect-fs-unix.lo CC libguestfs_la-inspect-fs-windows.lo CC libguestfs_la-inspect-icon.lo CC libguestfs_la-journal.lo CC libguestfs_la-launch.lo CC libguestfs_la-launch-direct.lo CC libguestfs_la-launch-libvirt.lo CC libguestfs_la-launch-uml.lo CC libguestfs_la-launch-unix.lo CC libguestfs_la-libvirt-auth.lo CC libguestfs_la-libvirt-domain.lo CC libguestfs_la-listfs.lo CC libguestfs_la-lpj.lo CC libguestfs_la-match.lo CC libguestfs_la-osinfo.lo CC libguestfs_la-private-data.lo CC libguestfs_la-proto.lo CC libguestfs_la-stringsbuf.lo CC libguestfs_la-structs-compare.lo CC libguestfs_la-structs-copy.lo CC libguestfs_la-structs-free.lo CC libguestfs_la-tmpdirs.lo CC liberrnostring_la-errnostring-gperf.lo CC liberrnostring_la-errnostring.lo CCLD liberrnostring.la CC libprotocol_la-guestfs_protocol.lo CCLD libprotocol.la CC libutils_la-cleanup.lo CC libutils_la-structs-cleanup.lo CC libutils_la-utils.lo CCLD libutils.la CCLD libguestfs.la CC libvirt_is_version-libvirt-is-version.o CCLD libvirt-is-version perl /home/ubuntu/libguestfs-1.26.1/podwrapper.pl \ --section 3 \ --man guestfs.3 \ --html ../html/guestfs.3.html \ --insert ./guestfs-actions.pod:__ACTIONS__ \ --insert ./guestfs-availability.pod:__AVAILABILITY__ \ --insert ./guestfs-structs.pod:__STRUCTS__ \ --license LGPLv2+ \ guestfs.pod podwrapper.pl: wrote guestfs.3 Wide character in print at /home/ubuntu/libguestfs-1.26.1/podwrapper.pl line 529. podwrapper.pl: wrote ../html/guestfs.3.html touch stamp-guestfs.pod make[3]: Leaving directory `/home/ubuntu/libguestfs-1.26.1/src' make[2]: Leaving directory `/home/ubuntu/libguestfs-1.26.1/src' Making all in examples make[2]: Entering directory `/home/ubuntu/libguestfs-1.26.1/examples' CC create_disk-create-disk.o CCLD create-disk CC debug_logging-debug-logging.o CCLD debug-logging CC display_icon-display-icon.o CCLD display-icon CC inspect_vm-inspect-vm.o CCLD inspect-vm CC copy_over-copy-over.o CCLD copy-over CC libvirt_auth-libvirt-auth.o CCLD libvirt-auth CC virt_dhcp_address-virt-dhcp-address.o CCLD virt-dhcp-address CC mount_local-mount-local.o CCLD mount-local perl /home/ubuntu/libguestfs-1.26.1/podwrapper.pl \ --section 3 \ --man guestfs-examples.3 \ --html ../html/guestfs-examples.3.html \ --verbatim ./copy-over.c:@COPY_OVER@ \ --verbatim ./create-disk.c:@CREATE_DISK@ \ --verbatim ./debug-logging.c:@DEBUG_LOGGING@ \ --verbatim ./display-icon.c:@DISPLAY_ICON@ \ --verbatim ./inspect-vm.c:@INSPECT_VM@ \ --verbatim ./libvirt-auth.c:@LIBVIRT_AUTH@ \ --verbatim ./mount-local.c:@MOUNT_LOCAL@ \ --verbatim ./virt-dhcp-address.c:@VIRT_DHCP_ADDRESS@ \ --license examples \ guestfs-examples.pod podwrapper.pl: wrote guestfs-examples.3 podwrapper.pl: wrote ../html/guestfs-examples.3.html touch stamp-guestfs-examples.pod perl /home/ubuntu/libguestfs-1.26.1/podwrapper.pl \ --section 1 \ --man guestfs-faq.1 \ --html ../html/guestfs-faq.1.html \ --license LGPLv2+ \ guestfs-faq.pod podwrapper.pl: wrote guestfs-faq.1 Wide character in print at /home/ubuntu/libguestfs-1.26.1/podwrapper.pl line 529. podwrapper.pl: wrote ../html/guestfs-faq.1.html touch stamp-guestfs-faq.pod perl /home/ubuntu/libguestfs-1.26.1/podwrapper.pl \ --section 1 \ --man guestfs-performance.1 \ --html ../html/guestfs-performance.1.html \ --license LGPLv2+ \ guestfs-performance.pod podwrapper.pl: wrote guestfs-performance.1 Wide character in print at /home/ubuntu/libguestfs-1.26.1/podwrapper.pl line 529. podwrapper.pl: wrote ../html/guestfs-performance.1.html touch stamp-guestfs-performance.pod perl /home/ubuntu/libguestfs-1.26.1/podwrapper.pl \ --section 1 \ --man guestfs-recipes.1 \ --html ../html/guestfs-recipes.1.html \ --license examples \ guestfs-recipes.pod podwrapper.pl: wrote guestfs-recipes.1 Wide character in print at /home/ubuntu/libguestfs-1.26.1/podwrapper.pl line 529. podwrapper.pl: wrote ../html/guestfs-recipes.1.html touch stamp-guestfs-recipes.pod perl /home/ubuntu/libguestfs-1.26.1/podwrapper.pl \ --section 1 \ --man guestfs-testing.1 \ --html ../html/guestfs-testing.1.html \ --license LGPLv2+ \ guestfs-testing.pod podwrapper.pl: wrote guestfs-testing.1 Wide character in print at /home/ubuntu/libguestfs-1.26.1/podwrapper.pl line 529. podwrapper.pl: wrote ../html/guestfs-testing.1.html touch stamp-guestfs-testing.pod make[2]: Leaving directory `/home/ubuntu/libguestfs-1.26.1/examples' Making all in po make[2]: Entering directory `/home/ubuntu/libguestfs-1.26.1/po' make[2]: Nothing to be done for `all'. make[2]: Leaving directory `/home/ubuntu/libguestfs-1.26.1/po' Making all in daemon make[2]: Entering directory `/home/ubuntu/libguestfs-1.26.1/daemon' make -C ../src guestfs_protocol.c make[3]: Entering directory `/home/ubuntu/libguestfs-1.26.1/src' make[3]: `guestfs_protocol.c' is up to date. make[3]: Leaving directory `/home/ubuntu/libguestfs-1.26.1/src' make -C ../src guestfs_protocol.h make[3]: Entering directory `/home/ubuntu/libguestfs-1.26.1/src' make[3]: `guestfs_protocol.h' is up to date. make[3]: Leaving directory `/home/ubuntu/libguestfs-1.26.1/src' make all-am make[3]: Entering directory `/home/ubuntu/libguestfs-1.26.1/daemon' make -C ../src guestfs_protocol.c make[4]: Entering directory `/home/ubuntu/libguestfs-1.26.1/src' make[4]: `guestfs_protocol.c' is up to date. make[4]: Leaving directory `/home/ubuntu/libguestfs-1.26.1/src' CC libprotocol_a-guestfs_protocol.o AR libprotocol.a CC liberrnostring_a-errnostring-gperf.o CC liberrnostring_a-errnostring.o AR liberrnostring.a CC guestfsd-9p.o CC guestfsd-acl.o CC guestfsd-available.o CC guestfsd-augeas.o CC guestfsd-base64.o CC guestfsd-blkdiscard.o CC guestfsd-blkid.o CC guestfsd-blockdev.o CC guestfsd-btrfs.o CC guestfsd-cap.o CC guestfsd-checksum.o CC guestfsd-cmp.o CC guestfsd-command.o CC guestfsd-compress.o CC guestfsd-copy.o CC guestfsd-cpmv.o CC guestfsd-dd.o CC guestfsd-debug.o CC guestfsd-devsparts.o CC guestfsd-df.o CC guestfsd-dir.o CC guestfsd-dmesg.o CC guestfsd-dropcaches.o CC guestfsd-du.o CC guestfsd-echo-daemon.o CC guestfsd-ext2.o CC guestfsd-fallocate.o CC guestfsd-file.o CC guestfsd-findfs.o CC guestfsd-fill.o CC guestfsd-find.o CC guestfsd-fsck.o CC guestfsd-fstrim.o CC guestfsd-glob.o CC guestfsd-grep.o CC guestfsd-grub.o CC guestfsd-guestfsd.o CC guestfsd-headtail.o CC guestfsd-hexdump.o CC guestfsd-hotplug.o CC guestfsd-hivex.o CC guestfsd-htonl.o CC guestfsd-initrd.o CC guestfsd-inotify.o CC guestfsd-internal.o CC guestfsd-is.o CC guestfsd-isoinfo.o CC guestfsd-journal.o CC guestfsd-labels.o CC guestfsd-ldm.o CC guestfsd-link.o CC guestfsd-ls.o CC guestfsd-luks.o CC guestfsd-lvm.o CC guestfsd-lvm-filter.o CC guestfsd-md.o CC guestfsd-mkfs.o CC guestfsd-mknod.o CC guestfsd-mktemp.o CC guestfsd-modprobe.o CC guestfsd-mount.o CC guestfsd-mountable.o CC guestfsd-names.o CC guestfsd-ntfs.o CC guestfsd-ntfsclone.o CC guestfsd-optgroups.o CC guestfsd-parted.o CC guestfsd-pingdaemon.o CC guestfsd-proto.o CC guestfsd-readdir.o CC guestfsd-realpath.o CC guestfsd-rename.o CC guestfsd-rsync.o CC guestfsd-scrub.o CC guestfsd-selinux.o CC guestfsd-sfdisk.o CC guestfsd-sleep.o CC guestfsd-stat.o CC guestfsd-statvfs.o CC guestfsd-strings.o CC guestfsd-stubs.o CC guestfsd-swap.o CC guestfsd-sync.o CC guestfsd-syslinux.o CC guestfsd-tar.o CC guestfsd-truncate.o CC guestfsd-umask.o CC guestfsd-upload.o CC guestfsd-utimens.o CC guestfsd-utsname.o CC guestfsd-uuids.o CC guestfsd-wc.o CC guestfsd-xattr.o CC guestfsd-xfs.o CC guestfsd-zero.o CC guestfsd-zerofree.o CCLD guestfsd perl /home/ubuntu/libguestfs-1.26.1/podwrapper.pl \ --section 8 \ --man guestfsd.8 \ --html ../html/guestfsd.8.html \ --license GPLv2+ \ guestfsd.pod podwrapper.pl: wrote guestfsd.8 podwrapper.pl: wrote ../html/guestfsd.8.html touch stamp-guestfsd.pod make[3]: Leaving directory `/home/ubuntu/libguestfs-1.26.1/daemon' make[2]: Leaving directory `/home/ubuntu/libguestfs-1.26.1/daemon' Making all in appliance make[2]: Entering directory `/home/ubuntu/libguestfs-1.26.1/appliance' perl /home/ubuntu/libguestfs-1.26.1/podwrapper.pl \ --man libguestfs-make-fixed-appliance.1 \ --html ../html/libguestfs-make-fixed-appliance.1.html \ --license GPLv2+ \ libguestfs-make-fixed-appliance.pod podwrapper.pl: wrote libguestfs-make-fixed-appliance.1 podwrapper.pl: wrote ../html/libguestfs-make-fixed-appliance.1.html touch stamp-libguestfs-make-fixed-appliance.pod cd .. && \ ./config.status --file=appliance/make.sh-t:appliance/make.sh.in config.status: creating appliance/make.sh-t chmod +x make.sh-t cmp -s make.sh make.sh-t || mv make.sh-t make.sh rm -f make.sh-t m4 -DUBUNTU=1 -DEXTRA_PACKAGES="" packagelist.in | \ grep -v '^[[:space:]]*$' | grep -v '^#' > packagelist-t cmp -s packagelist packagelist-t || mv packagelist-t packagelist rm -f packagelist-t rm -f stamp-supermin supermin.d/base.tar.gz supermin.d/packages ./make.sh /usr/bin/supermin --prepare -v -o supermin.d bsdmainutils btrfs-tools cryptsetup e2fsprogs extlinux genisoimage gfs-tools gfs2-tools grub2-common hfsplus iproute libaugeas0 libcap2 libhivex0 libpcre3 libsystemd-id128-0 libsystemd-journal0 libyajl2 linux-image mtools nilfs-tools ntfs-3g openssh-client reiserfsprogs sysvinit ufsutils vim-tiny xz-utils zfs-fuse acl attr bash binutils bzip2 coreutils cpio diffutils dosfstools file findutils gawk gdisk grep gzip jfsutils kmod less libxml2 lsof lsscsi lvm2 lzop mdadm module-init-tools parted procps procps-ng psmisc rsync scrub sed strace syslinux tar udev util-linux util-linux-ng xfsprogs zerofree supermin: version: 5.1.8 supermin: package handler: debian/dpkg supermin: prepare: bsdmainutils btrfs-tools cryptsetup e2fsprogs extlinux genisoimage gfs-tools gfs2-tools grub2-common hfsplus iproute libaugeas0 libcap2 libhivex0 libpcre3 libsystemd-id128-0 libsystemd-journal0 libyajl2 linux-image mtools nilfs-tools ntfs-3g openssh-client reiserfsprogs sysvinit ufsutils vim-tiny xz-utils zfs-fuse acl attr bash binutils bzip2 coreutils cpio diffutils dosfstools file findutils gawk gdisk grep gzip jfsutils kmod less libxml2 lsof lsscsi lvm2 lzop mdadm module-init-tools parted procps procps-ng psmisc rsync scrub sed strace syslinux tar udev util-linux util-linux-ng xfsprogs zerofree supermin: packages specified on the command line: - e2fsprogs_1.42.8-1ubuntu1_powerpc - genisoimage_9:1.1.11-2ubuntu3_powerpc - libaugeas0_1.1.0-0ubuntu2_powerpc - libcap2_1:2.22-1.2ubuntu2_powerpc - libhivex0_1.3.7-5_powerpc - libpcre3_1:8.31-2_powerpc - libsystemd-id128-0_204-0ubuntu19.2_powerpc - libsystemd-journal0_204-0ubuntu19.2_powerpc - libyajl2_2.0.4-4_powerpc - openssh-client_1:6.2p2-6ubuntu0.4_powerpc - xz-utils_5.1.1alpha+20120614-2ubuntu1_powerpc - acl_2.2.52-1_powerpc - bash_4.2-5ubuntu3_powerpc - binutils_2.23.52.20130913-0ubuntu1_powerpc - bzip2_1.0.6-4_powerpc - coreutils_8.20-3ubuntu5_powerpc - cpio_2.11+dfsg-1ubuntu1_powerpc - diffutils_1:3.2-8_powerpc - file_5.11-2ubuntu4.2_powerpc - findutils_4.4.2-6ubuntu1_powerpc - gawk_1:4.0.1+dfsg-2.1ubuntu2_powerpc - gdisk_0.8.7-1_powerpc - grep_2.14-3_powerpc - gzip_1.6-2ubuntu1_powerpc - kmod_9-3ubuntu1_powerpc - less_458-2_powerpc - libxml2_2.9.1+dfsg1-3ubuntu2.1_powerpc - lsof_4.86+dfsg-1ubuntu2_powerpc - lvm2_2.02.98-6ubuntu1_powerpc - module-init-tools_9-3ubuntu1_all - parted_2.3-16ubuntu1_powerpc - procps_1:3.3.3-2ubuntu9_powerpc - psmisc_22.20-1ubuntu2_powerpc - rsync_3.0.9-4ubuntu1_powerpc - sed_4.2.2-1ubuntu1_powerpc - strace_4.8-1ubuntu2_powerpc - tar_1.26+dfsg-8_powerpc - udev_204-0ubuntu19.1_powerpc - util-linux_2.20.1-5.1ubuntu9_powerpc supermin: writing supermin.d.57msgudp/packages supermin: after resolving dependencies there are 131 packages: - acl_2.2.52-1_powerpc - adduser_3.113+nmu3ubuntu2_all - augeas-lenses_1.1.0-0ubuntu2_all - base-files_6.12ubuntu4_powerpc - base-passwd_3.5.26_powerpc - bash_4.2-5ubuntu3_powerpc - binutils_2.23.52.20130913-0ubuntu1_powerpc - busybox-initramfs_1:1.20.0-8.1ubuntu1_powerpc - bzip2_1.0.6-4_powerpc - coreutils_8.20-3ubuntu5_powerpc - cpio_2.11+dfsg-1ubuntu1_powerpc - dash_0.5.7-3ubuntu1_powerpc - debconf_1.5.50ubuntu1_all - debianutils_4.4_powerpc - diffutils_1:3.2-8_powerpc - dmsetup_2:1.02.77-6ubuntu1_powerpc - dpkg_1.16.12ubuntu1_powerpc - e2fslibs_1.42.8-1ubuntu1_powerpc - e2fsprogs_1.42.8-1ubuntu1_powerpc - file_5.11-2ubuntu4.2_powerpc - findutils_4.4.2-6ubuntu1_powerpc - gawk_1:4.0.1+dfsg-2.1ubuntu2_powerpc - gcc-4.8-base_4.8.1-10ubuntu9_powerpc - gdisk_0.8.7-1_powerpc - genisoimage_9:1.1.11-2ubuntu3_powerpc - grep_2.14-3_powerpc - gzip_1.6-2ubuntu1_powerpc - ifupdown_0.7.44ubuntu3_powerpc - initramfs-tools-bin_0.103ubuntu1.1_powerpc - initramfs-tools_0.103ubuntu1.1_all - initscripts_2.88dsf-41ubuntu3_powerpc - insserv_1.14.0-5ubuntu2_powerpc - iproute2_3.10.0-1ubuntu1_powerpc - klibc-utils_2.0.1-3.1ubuntu2_powerpc - kmod_9-3ubuntu1_powerpc - less_458-2_powerpc - libacl1_2.2.52-1_powerpc - libattr1_1:2.4.47-1_powerpc - libaudit-common_1:2.2.2-1ubuntu4_all - libaudit1_1:2.2.2-1ubuntu4_powerpc - libaugeas0_1.1.0-0ubuntu2_powerpc - libblkid1_2.20.1-5.1ubuntu9_powerpc - libbz2-1.0_1.0.6-4_powerpc - libc6_2.17-93ubuntu4_powerpc - libcap2_1:2.22-1.2ubuntu2_powerpc - libcomerr2_1.42.8-1ubuntu1_powerpc - libdb5.1_5.1.29-7_powerpc - libdbus-1-3_1.6.12-0ubuntu10_powerpc - libdevmapper-event1.02.1_2:1.02.77-6ubuntu1_powerpc - libdevmapper1.02.1_2:1.02.77-6ubuntu1_powerpc - libdrm2_2.4.46-1ubuntu1_powerpc - libedit2_3.1-20130712-1_powerpc - libgcc1_1:4.8.1-10ubuntu9_powerpc - libgcrypt11_1.5.0-3ubuntu3_powerpc - libgpg-error0_1.12-0.2_powerpc - libgssapi-krb5-2_1.10.1+dfsg-6.1ubuntu1_powerpc - libhivex0_1.3.7-5_powerpc - libicu48_4.8.1.1-12ubuntu2_powerpc - libjson-c2_0.11-2ubuntu1_powerpc - libjson0_0.11-2ubuntu1_powerpc - libk5crypto3_1.10.1+dfsg-6.1ubuntu1_powerpc - libkeyutils1_1.5.5-7_powerpc - libklibc_2.0.1-3.1ubuntu2_powerpc - libkmod2_9-3ubuntu1_powerpc - libkrb5-3_1.10.1+dfsg-6.1ubuntu1_powerpc - libkrb5support0_1.10.1+dfsg-6.1ubuntu1_powerpc - liblzma5_5.1.1alpha+20120614-2ubuntu1_powerpc - libmagic1_5.11-2ubuntu4.2_powerpc - libmount1_2.20.1-5.1ubuntu9_powerpc - libncurses5_5.9+20130608-1ubuntu1_powerpc - libncursesw5_5.9+20130608-1ubuntu1_powerpc - libnih-dbus1_1.0.3-4ubuntu16_powerpc - libnih1_1.0.3-4ubuntu16_powerpc - libpam-modules-bin_1.1.3-8ubuntu3_powerpc - libpam-modules_1.1.3-8ubuntu3_powerpc - libpam0g_1.1.3-8ubuntu3_powerpc - libparted0debian1_2.3-16ubuntu1_powerpc - libpcre3_1:8.31-2_powerpc - libplymouth2_0.8.8-0ubuntu8_powerpc - libpng12-0_1.2.49-4ubuntu1_powerpc - libpopt0_1.16-7ubuntu3_powerpc - libprocps0_1:3.3.3-2ubuntu9_powerpc - libreadline5_5.2+dfsg-2_powerpc - libreadline6_6.2-9ubuntu1_powerpc - libselinux1_2.1.13-2_powerpc - libsemanage-common_2.1.10-2_all - libsemanage1_2.1.10-2_powerpc - libsepol1_2.1.9-2_powerpc - libsigsegv2_2.10-2_powerpc - libslang2_2.2.4-15ubuntu1_powerpc - libss2_1.42.8-1ubuntu1_powerpc - libssl1.0.0_1.0.1e-3ubuntu1_powerpc - libstdc++6_4.8.1-10ubuntu9_powerpc - libsystemd-id128-0_204-0ubuntu19.2_powerpc - libsystemd-journal0_204-0ubuntu19.2_powerpc - libtinfo5_5.9+20130608-1ubuntu1_powerpc - libudev1_204-0ubuntu19.1_powerpc - libustr-1.0-1_1.0.4-3ubuntu1_powerpc - libuuid1_2.20.1-5.1ubuntu9_powerpc - libxml2_2.9.1+dfsg1-3ubuntu2.1_powerpc - libyajl2_2.0.4-4_powerpc - lsb-base_4.1+Debian11ubuntu4_all - lsof_4.86+dfsg-1ubuntu2_powerpc - lvm2_2.02.98-6ubuntu1_powerpc - makedev_2.3.1-93ubuntu1_all - module-init-tools_9-3ubuntu1_all - mount_2.20.1-5.1ubuntu9_powerpc - mountall_2.52_powerpc - multiarch-support_2.17-93ubuntu4_powerpc - openssh-client_1:6.2p2-6ubuntu0.4_powerpc - parted_2.3-16ubuntu1_powerpc - passwd_1:4.1.5.1-1ubuntu6_powerpc - perl-base_5.14.2-21build1_powerpc - plymouth_0.8.8-0ubuntu8_powerpc - procps_1:3.3.3-2ubuntu9_powerpc - psmisc_22.20-1ubuntu2_powerpc - readline-common_6.2-9ubuntu1_all - rsync_3.0.9-4ubuntu1_powerpc - sed_4.2.2-1ubuntu1_powerpc - sensible-utils_0.0.9_all - strace_4.8-1ubuntu2_powerpc - sysv-rc_2.88dsf-41ubuntu3_all - sysvinit-utils_2.88dsf-41ubuntu3_powerpc - tar_1.26+dfsg-8_powerpc - tzdata_2013g-0ubuntu1_all - udev_204-0ubuntu19.1_powerpc - upstart_1.10-0ubuntu7_powerpc - util-linux_2.20.1-5.1ubuntu9_powerpc - watershed_7_powerpc - xz-utils_5.1.1alpha+20120614-2ubuntu1_powerpc - zlib1g_1:1.2.8.dfsg-1ubuntu1_powerpc Get:1 Downloading e2fsprogs 1.42.8-1ubuntu1 [1007 kB] Get:2 Downloading openssh-client 1:6.2p2-6ubuntu0.4 [430 kB] Get:3 Downloading bash 4.2-5ubuntu3 [620 kB] Get:4 Downloading kmod 9-3ubuntu1 [61.8 kB] Get:5 Downloading lvm2 2.02.98-6ubuntu1 [524 kB] Get:6 Downloading procps 1:3.3.3-2ubuntu9 [229 kB] Get:7 Downloading rsync 3.0.9-4ubuntu1 [311 kB] Get:8 Downloading tar 1.26+dfsg-8 [220 kB] Get:9 Downloading udev 204-0ubuntu19.2 [1084 kB] Get:10 Downloading util-linux 2.20.1-5.1ubuntu9 [627 kB] Get:11 Downloading libblkid1 2.20.1-5.1ubuntu9 [78.9 kB] Get:12 Downloading libc6 2.17-93ubuntu4 [4324 kB] Get:13 Downloading libmagic1 5.11-2ubuntu4.2 [169 kB] Get:14 Downloading adduser 3.113+nmu3ubuntu2 [166 kB] Get:15 Downloading dpkg 1.16.12ubuntu1.2 [2046 kB] Get:16 Downloading passwd 1:4.1.5.1-1ubuntu6 [1036 kB] Get:17 Downloading base-files 6.12ubuntu4 [63.8 kB] Get:18 Downloading initscripts 2.88dsf-41ubuntu3 [29.7 kB] Get:19 Downloading sysv-rc 2.88dsf-41ubuntu3 [38.1 kB] Get:20 Downloading debconf 1.5.50ubuntu1 [149 kB] Get:21 Downloading libpam-modules 1.1.3-8ubuntu3 [280 kB] Get:22 Downloading initramfs-tools 0.103ubuntu1.1 [49.1 kB] Get:23 Downloading sysvinit-utils 2.88dsf-41ubuntu3 [60.6 kB] Get:24 Downloading upstart 1.10-0ubuntu7 [542 kB] Get:25 Downloading mountall 2.52 [65.7 kB] Get:26 Downloading insserv 1.14.0-5ubuntu2 [42.5 kB] Get:27 Downloading libsemanage-common 2.1.10-2 [6422 B] Get:28 Downloading ifupdown 0.7.44ubuntu3.1 [55.6 kB] Get:29 Downloading plymouth 0.8.8-0ubuntu8 [115 kB] Get:30 Downloading libaudit-common 1:2.2.2-1ubuntu4 [5626 B] Get:31 Downloading iproute2 3.10.0-1ubuntu1 [527 kB] Fetched 15.0 MB in 2min 0s (124 kB/s) supermin: writing supermin.d.57msgudp/base.tar.gz supermin: renaming supermin.d.57msgudp to supermin.d make \ supermin.d/daemon.tar.gz \ supermin.d/excludefiles \ supermin.d/hostfiles \ supermin.d/init.tar.gz \ supermin.d/udev-rules.tar.gz make[3]: Entering directory `/home/ubuntu/libguestfs-1.26.1/appliance' rm -f supermin.d/daemon.tar.gz supermin.d/daemon.tar.gz-t rm -rf tmp-d mkdir -p tmp-d/sbin tmp-d/etc ln ../daemon/guestfsd tmp-d/sbin/guestfsd ln ./guestfsd.suppressions tmp-d/etc/guestfsd.suppressions ( cd tmp-d && tar zcf - * ) > supermin.d/daemon.tar.gz-t rm -r tmp-d mv supermin.d/daemon.tar.gz-t supermin.d/daemon.tar.gz m4 -DUBUNTU=1 -DEXTRA_PACKAGES="" excludefiles.in | \ grep -v '^[[:space:]]*$' | grep -v '^#' > excludefiles-t cmp -s supermin.d/excludefiles excludefiles-t || mv excludefiles-t supermin.d/excludefiles rm -f excludefiles-t m4 -DUBUNTU=1 -DEXTRA_PACKAGES="" hostfiles.in | \ grep -v '^[[:space:]]*$' | grep -v '^#' > hostfiles-t cmp -s supermin.d/hostfiles hostfiles-t || mv hostfiles-t supermin.d/hostfiles rm -f hostfiles-t rm -f supermin.d/init.tar.gz supermin.d/init.tar.gz-t ( cd . && tar zcf - init ) > supermin.d/init.tar.gz-t mv supermin.d/init.tar.gz-t supermin.d/init.tar.gz rm -f supermin.d/udev-rules.tar.gz supermin.d/udev-rules.tar.gz-t rm -rf tmp-u mkdir -p tmp-u/etc/udev/rules.d for f in 99-guestfs-serial.rules; do ln $f tmp-u/etc/udev/rules.d/$(basename $f); done ( cd tmp-u && tar zcf - etc ) > supermin.d/udev-rules.tar.gz-t rm -r tmp-u mv supermin.d/udev-rules.tar.gz-t supermin.d/udev-rules.tar.gz make[3]: Leaving directory `/home/ubuntu/libguestfs-1.26.1/appliance' touch stamp-supermin make[2]: Leaving directory `/home/ubuntu/libguestfs-1.26.1/appliance' Making all in tests/qemu make[2]: Entering directory `/home/ubuntu/libguestfs-1.26.1/tests/qemu' make[2]: Nothing to be done for `all'. make[2]: Leaving directory `/home/ubuntu/libguestfs-1.26.1/tests/qemu' Making all in tests/guests make[2]: Entering directory `/home/ubuntu/libguestfs-1.26.1/tests/guests' make[2]: Nothing to be done for `all'. make[2]: Leaving directory `/home/ubuntu/libguestfs-1.26.1/tests/guests' Making all in tests/c-api make[2]: Entering directory `/home/ubuntu/libguestfs-1.26.1/tests/c-api' make all-am make[3]: Entering directory `/home/ubuntu/libguestfs-1.26.1/tests/c-api' make[3]: Nothing to be done for `all-am'. make[3]: Leaving directory `/home/ubuntu/libguestfs-1.26.1/tests/c-api' make[2]: Leaving directory `/home/ubuntu/libguestfs-1.26.1/tests/c-api' Making all in tests/tmpdirs make[2]: Entering directory `/home/ubuntu/libguestfs-1.26.1/tests/tmpdirs' make[2]: Nothing to be done for `all'. make[2]: Leaving directory `/home/ubuntu/libguestfs-1.26.1/tests/tmpdirs' Making all in tests/protocol make[2]: Entering directory `/home/ubuntu/libguestfs-1.26.1/tests/protocol' make[2]: Nothing to be done for `all'. make[2]: Leaving directory `/home/ubuntu/libguestfs-1.26.1/tests/protocol' Making all in tests/events make[2]: Entering directory `/home/ubuntu/libguestfs-1.26.1/tests/events' make[2]: Nothing to be done for `all'. make[2]: Leaving directory `/home/ubuntu/libguestfs-1.26.1/tests/events' Making all in tests/parallel make[2]: Entering directory `/home/ubuntu/libguestfs-1.26.1/tests/parallel' make[2]: Nothing to be done for `all'. make[2]: Leaving directory `/home/ubuntu/libguestfs-1.26.1/tests/parallel' Making all in tests/create make[2]: Entering directory `/home/ubuntu/libguestfs-1.26.1/tests/create' make[2]: Nothing to be done for `all'. make[2]: Leaving directory `/home/ubuntu/libguestfs-1.26.1/tests/create' Making all in tests/disks make[2]: Entering directory `/home/ubuntu/libguestfs-1.26.1/tests/disks' make[2]: Nothing to be done for `all'. make[2]: Leaving directory `/home/ubuntu/libguestfs-1.26.1/tests/disks' Making all in tests/discard make[2]: Entering directory `/home/ubuntu/libguestfs-1.26.1/tests/discard' make[2]: Nothing to be done for `all'. make[2]: Leaving directory `/home/ubuntu/libguestfs-1.26.1/tests/discard' Making all in tests/mountable make[2]: Entering directory `/home/ubuntu/libguestfs-1.26.1/tests/mountable' make[2]: Nothing to be done for `all'. make[2]: Leaving directory `/home/ubuntu/libguestfs-1.26.1/tests/mountable' Making all in tests/network make[2]: Entering directory `/home/ubuntu/libguestfs-1.26.1/tests/network' make[2]: Nothing to be done for `all'. make[2]: Leaving directory `/home/ubuntu/libguestfs-1.26.1/tests/network' Making all in tests/lvm make[2]: Entering directory `/home/ubuntu/libguestfs-1.26.1/tests/lvm' make[2]: Nothing to be done for `all'. make[2]: Leaving directory `/home/ubuntu/libguestfs-1.26.1/tests/lvm' Making all in tests/luks make[2]: Entering directory `/home/ubuntu/libguestfs-1.26.1/tests/luks' make[2]: Nothing to be done for `all'. make[2]: Leaving directory `/home/ubuntu/libguestfs-1.26.1/tests/luks' Making all in tests/md make[2]: Entering directory `/home/ubuntu/libguestfs-1.26.1/tests/md' make[2]: Nothing to be done for `all'. make[2]: Leaving directory `/home/ubuntu/libguestfs-1.26.1/tests/md' Making all in tests/selinux make[2]: Entering directory `/home/ubuntu/libguestfs-1.26.1/tests/selinux' make[2]: Nothing to be done for `all'. make[2]: Leaving directory `/home/ubuntu/libguestfs-1.26.1/tests/selinux' Making all in tests/ntfsclone make[2]: Entering directory `/home/ubuntu/libguestfs-1.26.1/tests/ntfsclone' make[2]: Nothing to be done for `all'. make[2]: Leaving directory `/home/ubuntu/libguestfs-1.26.1/tests/ntfsclone' Making all in tests/btrfs make[2]: Entering directory `/home/ubuntu/libguestfs-1.26.1/tests/btrfs' make[2]: Nothing to be done for `all'. make[2]: Leaving directory `/home/ubuntu/libguestfs-1.26.1/tests/btrfs' Making all in tests/xfs make[2]: Entering directory `/home/ubuntu/libguestfs-1.26.1/tests/xfs' make[2]: Nothing to be done for `all'. make[2]: Leaving directory `/home/ubuntu/libguestfs-1.26.1/tests/xfs' Making all in tests/charsets make[2]: Entering directory `/home/ubuntu/libguestfs-1.26.1/tests/charsets' make[2]: Nothing to be done for `all'. make[2]: Leaving directory `/home/ubuntu/libguestfs-1.26.1/tests/charsets' Making all in tests/xml make[2]: Entering directory `/home/ubuntu/libguestfs-1.26.1/tests/xml' make[2]: Nothing to be done for `all'. make[2]: Leaving directory `/home/ubuntu/libguestfs-1.26.1/tests/xml' Making all in tests/mount-local make[2]: Entering directory `/home/ubuntu/libguestfs-1.26.1/tests/mount-local' make[2]: Nothing to be done for `all'. make[2]: Leaving directory `/home/ubuntu/libguestfs-1.26.1/tests/mount-local' Making all in tests/9p make[2]: Entering directory `/home/ubuntu/libguestfs-1.26.1/tests/9p' make[2]: Nothing to be done for `all'. make[2]: Leaving directory `/home/ubuntu/libguestfs-1.26.1/tests/9p' Making all in tests/rsync make[2]: Entering directory `/home/ubuntu/libguestfs-1.26.1/tests/rsync' make[2]: Nothing to be done for `all'. make[2]: Leaving directory `/home/ubuntu/libguestfs-1.26.1/tests/rsync' Making all in tests/bigdirs make[2]: Entering directory `/home/ubuntu/libguestfs-1.26.1/tests/bigdirs' make[2]: Nothing to be done for `all'. make[2]: Leaving directory `/home/ubuntu/libguestfs-1.26.1/tests/bigdirs' Making all in tests/disk-labels make[2]: Entering directory `/home/ubuntu/libguestfs-1.26.1/tests/disk-labels' make[2]: Nothing to be done for `all'. make[2]: Leaving directory `/home/ubuntu/libguestfs-1.26.1/tests/disk-labels' Making all in tests/hotplug make[2]: Entering directory `/home/ubuntu/libguestfs-1.26.1/tests/hotplug' make[2]: Nothing to be done for `all'. make[2]: Leaving directory `/home/ubuntu/libguestfs-1.26.1/tests/hotplug' Making all in tests/nbd make[2]: Entering directory `/home/ubuntu/libguestfs-1.26.1/tests/nbd' make[2]: Nothing to be done for `all'. make[2]: Leaving directory `/home/ubuntu/libguestfs-1.26.1/tests/nbd' Making all in tests/http make[2]: Entering directory `/home/ubuntu/libguestfs-1.26.1/tests/http' make[2]: Nothing to be done for `all'. make[2]: Leaving directory `/home/ubuntu/libguestfs-1.26.1/tests/http' Making all in tests/syslinux make[2]: Entering directory `/home/ubuntu/libguestfs-1.26.1/tests/syslinux' make[2]: Nothing to be done for `all'. make[2]: Leaving directory `/home/ubuntu/libguestfs-1.26.1/tests/syslinux' Making all in tests/journal make[2]: Entering directory `/home/ubuntu/libguestfs-1.26.1/tests/journal' make[2]: Nothing to be done for `all'. make[2]: Leaving directory `/home/ubuntu/libguestfs-1.26.1/tests/journal' Making all in tests/fuzz make[2]: Entering directory `/home/ubuntu/libguestfs-1.26.1/tests/fuzz' make[2]: Nothing to be done for `all'. make[2]: Leaving directory `/home/ubuntu/libguestfs-1.26.1/tests/fuzz' Making all in tests/relative-paths make[2]: Entering directory `/home/ubuntu/libguestfs-1.26.1/tests/relative-paths' make[2]: Nothing to be done for `all'. make[2]: Leaving directory `/home/ubuntu/libguestfs-1.26.1/tests/relative-paths' Making all in tests/regressions make[2]: Entering directory `/home/ubuntu/libguestfs-1.26.1/tests/regressions' make[2]: Nothing to be done for `all'. make[2]: Leaving directory `/home/ubuntu/libguestfs-1.26.1/tests/regressions' Making all in test-tool make[2]: Entering directory `/home/ubuntu/libguestfs-1.26.1/test-tool' CC libguestfs_test_tool-test-tool.o CCLD libguestfs-test-tool perl /home/ubuntu/libguestfs-1.26.1/podwrapper.pl \ --man libguestfs-test-tool.1 \ --html ../html/libguestfs-test-tool.1.html \ --license GPLv2+ \ libguestfs-test-tool.pod podwrapper.pl: wrote libguestfs-test-tool.1 Wide character in print at /home/ubuntu/libguestfs-1.26.1/podwrapper.pl line 529. podwrapper.pl: wrote ../html/libguestfs-test-tool.1.html touch stamp-libguestfs-test-tool.pod make[2]: Leaving directory `/home/ubuntu/libguestfs-1.26.1/test-tool' Making all in fish make[2]: Entering directory `/home/ubuntu/libguestfs-1.26.1/fish' make all-am make[3]: Entering directory `/home/ubuntu/libguestfs-1.26.1/fish' CC libcmds_la-cmds-gperf.lo CCLD libcmds.la CC librc_protocol_la-rc_protocol.lo CCLD librc_protocol.la CC guestfish-cmds.o CC guestfish-completion.o CC guestfish-event-names.o CC guestfish-prepopts.o CC guestfish-config.o CC guestfish-domain.o CC guestfish-inspect.o CC guestfish-keys.o CC guestfish-options.o CC guestfish-progress.o CC guestfish-uri.o CC guestfish-alloc.o CC guestfish-copy.o CC guestfish-destpaths.o CC guestfish-display.o CC guestfish-echo.o CC guestfish-edit.o CC guestfish-events.o CC guestfish-fish.o fish.c: In function 'main': fish.c:173:3: warning: implicit declaration of function 'time' [-Wimplicit-function-declaration] srandom (time (NULL)); ^ fish.c: In function 'script': fish.c:699:7: warning: implicit declaration of function 'decode_ps1' [-Wimplicit-function-declaration] CLEANUP_FREE char *pi = decode_ps1 (ps_init); ^ fish.c:699:31: warning: initialization makes pointer from integer without a cast [enabled by default] CLEANUP_FREE char *pi = decode_ps1 (ps_init); ^ fish.c:742:31: warning: initialization makes pointer from integer without a cast [enabled by default] CLEANUP_FREE char *pr = decode_ps1 (ps_restore); ^ CC guestfish-glob.o CC guestfish-help.o CC guestfish-hexedit.o CC guestfish-lcd.o CC guestfish-man.o CC guestfish-more.o CC guestfish-prep.o CC guestfish-prep-disk.o CC guestfish-prep-part.o CC guestfish-prep-fs.o CC guestfish-prep-lv.o CC guestfish-prep-boot.o CC guestfish-rc.o CC guestfish-reopen.o CC guestfish-setenv.o CC guestfish-supported.o CC guestfish-tilde.o CC guestfish-time.o CCLD guestfish guestfish-progress.o: In function `progress_bar_init': /home/ubuntu/libguestfs-1.26.1/fish/progress.c:123: undefined reference to `tgetent' guestfish-progress.o: In function `progress_bar_set': /home/ubuntu/libguestfs-1.26.1/fish/progress.c:282: undefined reference to `tgetnum' /home/ubuntu/libguestfs-1.26.1/fish/progress.c:297: undefined reference to `UP' guestfish-progress.o: In function `fprintf': /usr/include/powerpc-linux-gnu/bits/stdio2.h:97: undefined reference to `UP' collect2: error: ld returned 1 exit status make[3]: *** [guestfish] Error 1 make[3]: Leaving directory `/home/ubuntu/libguestfs-1.26.1/fish' make[2]: *** [all] Error 2 make[2]: Leaving directory `/home/ubuntu/libguestfs-1.26.1/fish' make[1]: *** [all-recursive] Error 1 make[1]: Leaving directory `/home/ubuntu/libguestfs-1.26.1' make: *** [all] Error 2 ubuntu@t4240-ubuntu1310:~/libguestfs-1.26.1$ On Thu, May 29, 2014 at 8:48 PM, Richard W.M. Jones <rjones@redhat.com> wrote:
On Thu, May 29, 2014 at 08:31:06PM +0530, abhishek jain wrote:
Hi Rich
I using ubuntu 13.10 with powerpc arch. I tried the above stepss and below are the output of the related commands..
nm -D /usr/lib/powerpc-linux-gnu/libtinfo.so | grep tgetent 0000def0 T tgetent ubuntu@t4240-ubuntu1310:~$ dpkg -S /usr/lib/powerpc-linux-gnu/libtinfo.so libtinfo-dev:powerpc: /usr/lib/powerpc-linux-gnu/libtinfo.so
However I'm not able to perform rm -f config.cache as there is no config.cache file
The config.cache file only exists if you are using the ./configure -C option. If it doesn't exist you can ignore it.
Does it work after ./configure && make clean && make ?
If not then please copy the entire output of that command into an email message.
libguestfs works on ppc (64 bit anyway - I've not used ppc32 for a while), and this doesn't look like it would be a POWER-related problem in any case.
Rich.
-- Richard Jones, Virtualization Group, Red Hat http://people.redhat.com/~rjones Read my programming and virtualization blog: http://rwmj.wordpress.com virt-top is 'top' for virtual machines. Tiny program with many powerful monitoring features, net stats, disk stats, logging, etc. http://people.redhat.com/~rjones/virt-top
On Thu, May 29, 2014 at 09:23:56PM +0530, abhishek jain wrote:
Hi Rich
Yes Rich I have tried libguesftfs on powerpc and it was working fine.For some reason i had to format my hard disk and now when I'm again compiling it,I'm getting following error....
Below is the status of configure ..
This is how we have configured the optional components for you today:
Daemon .............................. yes Appliance ........................... yes
I need to see the entire output of configure. You could also do: make V=1 and add all of that output too. Rich. -- Richard Jones, Virtualization Group, Red Hat http://people.redhat.com/~rjones Read my programming and virtualization blog: http://rwmj.wordpress.com virt-df lists disk usage of guests without needing to install any software inside the virtual machine. Supports Linux and Windows. http://people.redhat.com/~rjones/virt-df/
Here's the output of configure.... sudo ./configure checking for a BSD-compatible install... /usr/bin/install -c checking whether build environment is sane... yes checking for a thread-safe mkdir -p... /bin/mkdir -p checking for gawk... gawk checking whether make sets $(MAKE)... yes checking whether make supports nested variables... yes checking whether make supports nested variables... (cached) yes checking if 1.26 is a stable or development branch of libguestfs... stable configure: libguestfs version 1.26.1 checking if the user specified a default backend... direct checking for style of include used by make... GNU checking for gcc... gcc checking whether the C compiler works... yes checking for C compiler default output file name... a.out checking for suffix of executables... checking whether we are cross compiling... no checking for suffix of object files... o checking whether we are using the GNU C compiler... yes checking whether gcc accepts -g... yes checking for gcc option to accept ISO C89... none needed checking dependency style of gcc... gcc3 checking how to run the C preprocessor... gcc -E checking for grep that handles long lines and -e... /bin/grep checking for egrep... /bin/grep -E checking for Minix Amsterdam compiler... no checking for ar... ar checking for ranlib... ranlib checking whether gcc and cc understand -c and -o together... yes checking for ANSI C header files... yes checking for sys/types.h... yes checking for sys/stat.h... yes checking for stdlib.h... yes checking for string.h... yes checking for memory.h... yes checking for strings.h... yes checking for inttypes.h... yes checking for stdint.h... yes checking for unistd.h... yes checking minix/config.h usability... no checking minix/config.h presence... no checking for minix/config.h... no checking whether it is safe to define __EXTENSIONS__... yes checking whether _XOPEN_SOURCE should be defined... no checking build system type... powerpc64-unknown-linux-gnu checking host system type... powerpc64-unknown-linux-gnu checking for _LARGEFILE_SOURCE value needed for large files... no checking for special C compiler options needed for large files... no checking for _FILE_OFFSET_BITS value needed for large files... 64 checking for gcc option to accept ISO C99... -std=gnu99 checking for gcc -std=gnu99 option to accept ISO Standard C... (cached) -std=gnu99 checking sys/socket.h usability... yes checking sys/socket.h presence... yes checking for sys/socket.h... yes checking arpa/inet.h usability... yes checking arpa/inet.h presence... yes checking for arpa/inet.h... yes checking features.h usability... yes checking features.h presence... yes checking for features.h... yes checking for unistd.h... (cached) yes checking sys/param.h usability... yes checking sys/param.h presence... yes checking for sys/param.h... yes checking dirent.h usability... yes checking dirent.h presence... yes checking for dirent.h... yes checking wctype.h usability... yes checking wctype.h presence... yes checking for wctype.h... yes checking stdio_ext.h usability... yes checking stdio_ext.h presence... yes checking for stdio_ext.h... yes checking for sys/stat.h... (cached) yes checking sys/vfs.h usability... yes checking sys/vfs.h presence... yes checking for sys/vfs.h... yes checking sys/fs_types.h usability... no checking sys/fs_types.h presence... no checking for sys/fs_types.h... no checking netdb.h usability... yes checking netdb.h presence... yes checking for netdb.h... yes checking netinet/in.h usability... yes checking netinet/in.h presence... yes checking for netinet/in.h... yes checking getopt.h usability... yes checking getopt.h presence... yes checking for getopt.h... yes checking sys/time.h usability... yes checking sys/time.h presence... yes checking for sys/time.h... yes checking sys/cdefs.h usability... yes checking sys/cdefs.h presence... yes checking for sys/cdefs.h... yes checking wchar.h usability... yes checking wchar.h presence... yes checking for wchar.h... yes checking for stdint.h... (cached) yes checking for inttypes.h... (cached) yes checking xlocale.h usability... yes checking xlocale.h presence... yes checking for xlocale.h... yes checking sys/mman.h usability... yes checking sys/mman.h presence... yes checking for sys/mman.h... yes checking sys/select.h usability... yes checking sys/select.h presence... yes checking for sys/select.h... yes checking sys/uio.h usability... yes checking sys/uio.h presence... yes checking for sys/uio.h... yes checking sys/wait.h usability... yes checking sys/wait.h presence... yes checking for sys/wait.h... yes checking utime.h usability... yes checking utime.h presence... yes checking for utime.h... yes checking priv.h usability... no checking priv.h presence... no checking for priv.h... no checking sys/ioctl.h usability... yes checking sys/ioctl.h presence... yes checking for sys/ioctl.h... yes checking whether the preprocessor supports include_next... yes checking whether system header files limit the line length... no checking whether <sys/socket.h> is self-contained... yes checking for shutdown... yes checking whether <sys/socket.h> defines the SHUT_* macros... yes checking for struct sockaddr_storage... yes checking for sa_family_t... yes checking for struct sockaddr_storage.ss_family... yes checking whether socket is declared without a macro... yes checking whether connect is declared without a macro... yes checking whether accept is declared without a macro... yes checking whether bind is declared without a macro... yes checking whether getpeername is declared without a macro... yes checking whether getsockname is declared without a macro... yes checking whether getsockopt is declared without a macro... yes checking whether listen is declared without a macro... yes checking whether recv is declared without a macro... yes checking whether send is declared without a macro... yes checking whether recvfrom is declared without a macro... yes checking whether sendto is declared without a macro... yes checking whether setsockopt is declared without a macro... yes checking whether shutdown is declared without a macro... yes checking whether accept4 is declared without a macro... yes checking for accept4... yes checking for readlinkat... yes checking for _set_invalid_parameter_handler... no checking for fchdir... yes checking for fdopendir... yes checking for dup3... yes checking for setdtablesize... no checking for fcntl... yes checking for symlink... yes checking for mempcpy... yes checking for btowc... yes checking for isblank... yes checking for iswctype... yes checking for mbsrtowcs... yes checking for wmemchr... yes checking for wmemcpy... yes checking for wmempcpy... yes checking for fstatat... yes checking for openat... yes checking for fstatfs... yes checking for futimens... yes checking for getdelim... yes checking for getdtablesize... yes checking for getlogin_r... yes checking for gettimeofday... yes checking for nanotime... no checking for getpwnam_r... yes checking for lstat... yes checking for mbsinit... yes checking for mbrtowc... yes checking for mprotect... yes checking for mkstemps... yes checking for strerror_r... yes checking for __xpg_strerror_r... yes checking for pipe2... yes checking for pread... yes checking for readlink... yes checking for secure_getenv... yes checking for setenv... yes checking for sleep... yes checking for snprintf... yes checking for strdup... yes checking for catgets... yes checking for strndup... yes checking for strtoumax... yes checking for symlinkat... yes checking for pipe... yes checking for futimes... yes checking for futimesat... yes checking for utimensat... yes checking for lutimes... yes checking for vasnprintf... no checking for iswcntrl... yes checking for ftruncate... yes checking for newlocale... yes checking for sigaction... yes checking for sigaltstack... yes checking for siginterrupt... yes checking for shutdown... (cached) yes checking for unlinkat... yes checking for wcrtomb... yes checking for wctob... yes checking for size_t... yes checking for working alloca.h... yes checking for alloca... yes checking whether // is distinct from /... no checking if environ is properly declared... yes checking for complete errno.h... yes checking whether strerror_r is declared... yes checking for strerror_r... (cached) yes checking whether strerror_r returns char *... yes checking whether fchdir is declared... yes checking for working fcntl.h... yes checking for pid_t... yes checking for mode_t... yes checking for promoted mode_t type... mode_t checking for mbstate_t... yes checking whether stat file-mode macros are broken... no checking for nlink_t... yes checking whether fchmodat is declared without a macro... yes checking whether fstat is declared without a macro... yes checking whether fstatat is declared without a macro... yes checking whether futimens is declared without a macro... yes checking whether lchmod is declared without a macro... yes checking whether lstat is declared without a macro... yes checking whether mkdirat is declared without a macro... yes checking whether mkfifo is declared without a macro... yes checking whether mkfifoat is declared without a macro... yes checking whether mknod is declared without a macro... yes checking whether mknodat is declared without a macro... yes checking whether stat is declared without a macro... yes checking whether utimensat is declared without a macro... yes checking whether lstat correctly handles trailing slash... yes checking whether stdin defaults to large file offsets... yes checking whether ftello is declared... yes checking for ftello... yes checking whether ftello works... yes checking whether getaddrinfo is declared without a macro... yes checking whether freeaddrinfo is declared without a macro... yes checking whether gai_strerror is declared without a macro... yes checking whether getnameinfo is declared without a macro... yes checking for library containing gethostbyname... none required checking for gethostbyname... yes checking for library containing getservbyname... none required checking for getservbyname... yes checking for C/C++ restrict keyword... __restrict checking for library containing inet_ntop... none required checking whether inet_ntop is declared... yes checking for IPv4 sockets... yes checking for IPv6 sockets... yes checking whether getcwd (NULL, 0) allocates memory for result... yes checking for getcwd with POSIX signature... yes checking whether getdelim is declared... yes checking whether getline is declared... yes checking whether getlogin_r is declared... yes checking whether getlogin is declared... yes checking for getopt.h... (cached) yes checking for getopt_long_only... yes checking whether getopt is POSIX compatible... yes checking for working GNU getopt function... yes checking for working GNU getopt_long function... yes checking whether getenv is declared... yes checking for struct timeval... yes checking for wide-enough struct timeval.tv_sec member... yes checking whether gettimeofday is declared without a macro... yes checking for unsigned long long int... yes checking for long long int... yes checking whether stdint.h conforms to C99... yes checking whether imaxabs is declared without a macro... yes checking whether imaxdiv is declared without a macro... yes checking whether strtoimax is declared without a macro... yes checking whether strtoumax is declared without a macro... yes checking for nl_langinfo and CODESET... yes checking whether getc_unlocked is declared... yes checking whether we are using the GNU C Library >= 2.1 or uClibc... yes checking for wchar_t... yes checking whether NULL can be used in arbitrary expressions... yes checking for ld used by gcc -std=gnu99... /usr/bin/ld checking if the linker (/usr/bin/ld) is GNU ld... yes checking for shared library run path origin... done checking whether imported symbols can be declared weak... yes checking pthread.h usability... yes checking pthread.h presence... yes checking for pthread.h... yes checking for pthread_kill in -lpthread... yes checking for multithread API to use... posix checking for a sed that does not truncate output... /bin/sed checking whether malloc, realloc, calloc are POSIX compliant... yes checking for stdlib.h... (cached) yes checking for GNU libc compatible malloc... yes checking for a traditional japanese locale... none checking for a transitional chinese locale... none checking for a french Unicode locale... none checking for a traditional french locale... none checking for mmap... yes checking for MAP_ANONYMOUS... yes checking whether memchr works... yes checking whether memmem is declared... yes checking for memmem... yes checking whether memmem works... yes checking whether memrchr is declared... yes checking whether strerror(0) succeeds... yes checking for strerror_r with POSIX signature... no checking whether __xpg_strerror_r works... yes checking whether strerror_r is declared... (cached) yes checking for sigset_t... yes checking for ssize_t... yes checking whether <sys/select.h> is self-contained... yes checking whether pselect is declared without a macro... yes checking whether select is declared without a macro... yes checking for inline... inline checking for library containing setsockopt... none needed checking whether setenv is declared... yes checking search.h usability... yes checking search.h presence... yes checking for search.h... yes checking for tsearch... yes checking for uid_t in sys/types.h... yes checking whether snprintf returns a byte count as in C99... yes checking whether snprintf is declared... yes checking for stdbool.h that conforms to C99... yes checking for _Bool... yes checking whether strdup is declared... yes checking whether ffsl is declared without a macro... yes checking whether ffsll is declared without a macro... yes checking whether memmem is declared without a macro... yes checking whether mempcpy is declared without a macro... yes checking whether memrchr is declared without a macro... yes checking whether rawmemchr is declared without a macro... yes checking whether stpcpy is declared without a macro... yes checking whether stpncpy is declared without a macro... yes checking whether strchrnul is declared without a macro... yes checking whether strdup is declared without a macro... yes checking whether strncat is declared without a macro... yes checking whether strndup is declared without a macro... yes checking whether strnlen is declared without a macro... yes checking whether strpbrk is declared without a macro... yes checking whether strsep is declared without a macro... yes checking whether strcasestr is declared without a macro... yes checking whether strtok_r is declared without a macro... yes checking whether strerror_r is declared without a macro... yes checking whether strsignal is declared without a macro... yes checking whether strverscmp is declared without a macro... yes checking whether strndup is declared... (cached) yes checking whether strnlen is declared... (cached) yes checking whether strtoumax is declared... (cached) yes checking for struct timespec in <time.h>... yes checking whether the utimes function works... yes checking for struct utimbuf... yes checking for wint_t... yes checking for inttypes.h... yes checking for stdint.h... yes checking for intmax_t... yes checking where to find the exponent in a 'double'... word 0 bit 20 checking for snprintf... (cached) yes checking for strnlen... yes checking for wcslen... yes checking for wcsnlen... yes checking for mbrtowc... (cached) yes checking for wcrtomb... (cached) yes checking whether _snprintf is declared... no checking whether <wchar.h> uses 'inline' correctly... yes checking whether ungetc works on arbitrary bytes... yes checking for off_t... yes checking for inttypes.h... (cached) yes checking whether the inttypes.h PRIxNN macros are broken... no checking for LC_MESSAGES... yes checking for CFPreferencesCopyAppValue... no checking for CFLocaleCopyCurrent... no checking whether alarm is declared... yes checking whether unsetenv is declared... yes checking for alloca as a compiler built-in... yes checking whether inet_ntop is declared without a macro... yes checking whether inet_pton is declared without a macro... yes checking byteswap.h usability... yes checking byteswap.h presence... yes checking for byteswap.h... yes checking whether this system has an arbitrary file name length limit... yes checking for library containing clock_gettime... none required checking for clock_gettime... yes checking for clock_settime... yes checking for closedir... yes checking for d_ino member in directory struct... yes checking for d_type member in directory struct... yes checking whether alphasort is declared without a macro... yes checking whether closedir is declared without a macro... yes checking whether dirfd is declared without a macro... yes checking whether fdopendir is declared without a macro... yes checking whether opendir is declared without a macro... yes checking whether readdir is declared without a macro... yes checking whether rewinddir is declared without a macro... yes checking whether scandir is declared without a macro... yes checking for dirfd... yes checking whether dirfd is declared... (cached) yes checking whether dirfd is a macro... no checking whether // is distinct from /... (cached) no checking whether dup2 works... yes checking for error_at_line... yes checking whether fcntl handles F_DUPFD correctly... yes checking whether fcntl understands F_DUPFD_CLOEXEC... needs runtime check checking whether fcntl is declared without a macro... yes checking whether openat is declared without a macro... yes checking whether fdopendir is declared... (cached) yes checking whether fdopendir works... yes checking whether conversion from 'int' to 'long double' works... yes checking for working POSIX fnmatch... yes checking for __fpending... yes checking whether __fpending is declared... yes checking whether fstatat (..., 0) works... yes checking for sys/mount.h... yes configure: checking how to get file system space usage checking for statvfs function (SVR4)... yes checking whether to use statvfs64... no checking for two-argument statfs with statfs.f_frsize member... yes checking dustat.h usability... no checking dustat.h presence... no checking for dustat.h... no checking sys/fs/s5param.h usability... no checking sys/fs/s5param.h presence... no checking for sys/fs/s5param.h... no checking sys/filsys.h usability... no checking sys/filsys.h presence... no checking for sys/filsys.h... no checking sys/statfs.h usability... yes checking sys/statfs.h presence... yes checking for sys/statfs.h... yes checking for statfs that truncates block counts... no checking for ftello... (cached) yes checking whether ftello works... (cached) yes checking for struct statfs.f_type... yes checking whether futimens works... needs runtime check configure: checking how to do getaddrinfo, freeaddrinfo and getnameinfo checking for library containing getaddrinfo... none required checking for getaddrinfo... yes checking whether gai_strerror is declared... (cached) yes checking whether gai_strerrorA is declared... no checking for gai_strerror with POSIX signature... yes checking for struct sockaddr.sa_len... no checking whether getaddrinfo is declared... (cached) yes checking whether freeaddrinfo is declared... (cached) yes checking whether getnameinfo is declared... (cached) yes checking for struct addrinfo... yes checking for working getdelim function... yes checking whether getdtablesize works... yes checking for getline... yes checking for working getline function... yes checking whether getlogin_r works with small buffers... yes checking whether gettimeofday clobbers localtime buffer... no checking for gettimeofday with POSIX signature... almost checking glob.h usability... yes checking glob.h presence... yes checking for glob.h... yes checking for GNU glob interface version 1... yes checking whether glob lists broken symlinks... no checking for library containing gethostbyname... (cached) none required checking for gethostbyname... (cached) yes checking for library containing inet_ntop... (cached) none required checking whether inet_ntop is declared... (cached) yes checking whether locale.h conforms to POSIX:2001... yes checking whether locale.h defines locale_t... yes checking whether struct lconv is properly defined... yes checking whether setlocale is declared without a macro... yes checking whether duplocale is declared without a macro... yes checking for pthread_rwlock_t... yes checking whether lseek detects pipes... yes checking whether mbrtowc handles incomplete characters... guessing yes checking whether mbrtowc works as well as mbtowc... guessing yes checking whether mbrtowc handles a NULL pwc argument... guessing yes checking whether mbrtowc handles a NULL string argument... guessing yes checking whether mbrtowc has a correct return value... guessing yes checking whether mbrtowc returns 0 when parsing a NUL character... guessing yes checking whether mbrtowc handles incomplete characters... (cached) guessing yes checking whether mbrtowc works as well as mbtowc... (cached) guessing yes checking whether mbrtowc handles incomplete characters... (cached) guessing yes checking whether mbrtowc works as well as mbtowc... (cached) guessing yes checking whether mbsrtowcs works... guessing yes checking whether memmem works in linear time... yes checking for memmem... (cached) yes checking whether memmem works... (cached) yes checking for mempcpy... (cached) yes checking for memrchr... yes checking for mkdtemp... yes checking whether getaddrinfo is declared without a macro... (cached) yes checking whether freeaddrinfo is declared without a macro... (cached) yes checking whether gai_strerror is declared without a macro... (cached) yes checking whether getnameinfo is declared without a macro... (cached) yes checking whether <netinet/in.h> is self-contained... yes checking whether open recognizes a trailing slash... yes checking for opendir... yes checking whether perror matches strerror... yes checking whether pread works... yes checking for raise... yes checking for sigprocmask... yes checking for rawmemchr... yes checking for readdir... yes checking whether readlink signature is correct... yes checking whether readlink handles trailing slash correctly... yes checking whether select supports a 0 argument... yes checking whether select detects invalid fds... yes checking for library containing getservbyname... (cached) none required checking for getservbyname... (cached) yes checking whether setenv validates arguments... yes checking for volatile sig_atomic_t... yes checking for sighandler_t... yes checking whether pthread_sigmask is declared without a macro... yes checking whether sigaction is declared without a macro... yes checking whether sigaddset is declared without a macro... yes checking whether sigdelset is declared without a macro... yes checking whether sigemptyset is declared without a macro... yes checking whether sigfillset is declared without a macro... yes checking whether sigismember is declared without a macro... yes checking whether sigpending is declared without a macro... yes checking whether sigprocmask is declared without a macro... yes checking for stdint.h... (cached) yes checking for SIZE_MAX... yes checking whether sleep is declared... yes checking for working sleep... yes checking for snprintf... (cached) yes checking whether snprintf respects a size of 1... yes checking whether printf supports POSIX/XSI format strings with positions... yes checking for library containing setsockopt... (cached) none needed checking for socklen_t... yes checking for ssize_t... (cached) yes checking whether stat handles trailing slashes on directories... yes checking whether stat handles trailing slashes on files... yes checking for struct stat.st_atim.tv_nsec... yes checking whether struct stat.st_atim is of type struct timespec... yes checking for struct stat.st_birthtimespec.tv_nsec... no checking for struct stat.st_birthtimensec... no checking for struct stat.st_birthtim.tv_nsec... no checking for working stdalign.h... yes checking for va_copy... yes checking whether NULL can be used in arbitrary expressions... (cached) yes checking whether dprintf is declared without a macro... yes checking whether fpurge is declared without a macro... no checking whether fseeko is declared without a macro... yes checking whether ftello is declared without a macro... yes checking whether getdelim is declared without a macro... yes checking whether getline is declared without a macro... yes checking whether gets is declared without a macro... no checking whether pclose is declared without a macro... yes checking whether popen is declared without a macro... yes checking whether renameat is declared without a macro... yes checking whether snprintf is declared without a macro... yes checking whether tmpfile is declared without a macro... yes checking whether vdprintf is declared without a macro... yes checking whether vsnprintf is declared without a macro... yes checking whether _Exit is declared without a macro... yes checking whether atoll is declared without a macro... yes checking whether canonicalize_file_name is declared without a macro... yes checking whether getloadavg is declared without a macro... yes checking whether getsubopt is declared without a macro... yes checking whether grantpt is declared without a macro... yes checking whether initstate is declared without a macro... yes checking whether initstate_r is declared without a macro... yes checking whether mkdtemp is declared without a macro... yes checking whether mkostemp is declared without a macro... yes checking whether mkostemps is declared without a macro... yes checking whether mkstemp is declared without a macro... yes checking whether mkstemps is declared without a macro... yes checking whether posix_openpt is declared without a macro... yes checking whether ptsname is declared without a macro... yes checking whether ptsname_r is declared without a macro... yes checking whether random is declared without a macro... yes checking whether random_r is declared without a macro... yes checking whether realpath is declared without a macro... yes checking whether rpmatch is declared without a macro... yes checking whether secure_getenv is declared without a macro... yes checking whether setenv is declared without a macro... yes checking whether setstate is declared without a macro... yes checking whether setstate_r is declared without a macro... yes checking whether srandom is declared without a macro... yes checking whether srandom_r is declared without a macro... yes checking whether strtod is declared without a macro... yes checking whether strtoll is declared without a macro... yes checking whether strtoull is declared without a macro... yes checking whether unlockpt is declared without a macro... yes checking whether unsetenv is declared without a macro... yes checking for strchrnul... yes checking whether strchrnul works... yes checking for working strerror function... yes checking for working strndup... yes checking for working strnlen... yes checking for strtoll... yes checking for strtoull... yes checking whether symlink handles trailing slash correctly... yes checking whether <sys/select.h> is self-contained... (cached) yes checking whether pselect is declared without a macro... (cached) yes checking whether select is declared without a macro... (cached) yes checking whether <sys/socket.h> is self-contained... (cached) yes checking for shutdown... (cached) yes checking whether <sys/socket.h> defines the SHUT_* macros... (cached) yes checking for struct sockaddr_storage... (cached) yes checking for sa_family_t... (cached) yes checking for struct sockaddr_storage.ss_family... (cached) yes checking whether socket is declared without a macro... (cached) yes checking whether connect is declared without a macro... (cached) yes checking whether accept is declared without a macro... (cached) yes checking whether bind is declared without a macro... (cached) yes checking whether getpeername is declared without a macro... (cached) yes checking whether getsockname is declared without a macro... (cached) yes checking whether getsockopt is declared without a macro... (cached) yes checking whether listen is declared without a macro... (cached) yes checking whether recv is declared without a macro... (cached) yes checking whether send is declared without a macro... (cached) yes checking whether recvfrom is declared without a macro... (cached) yes checking whether sendto is declared without a macro... (cached) yes checking whether setsockopt is declared without a macro... (cached) yes checking whether shutdown is declared without a macro... (cached) yes checking whether accept4 is declared without a macro... (cached) yes checking for nlink_t... (cached) yes checking whether fchmodat is declared without a macro... (cached) yes checking whether fstat is declared without a macro... (cached) yes checking whether fstatat is declared without a macro... (cached) yes checking whether futimens is declared without a macro... (cached) yes checking whether lchmod is declared without a macro... (cached) yes checking whether lstat is declared without a macro... (cached) yes checking whether mkdirat is declared without a macro... (cached) yes checking whether mkfifo is declared without a macro... (cached) yes checking whether mkfifoat is declared without a macro... (cached) yes checking whether mknod is declared without a macro... (cached) yes checking whether mknodat is declared without a macro... (cached) yes checking whether stat is declared without a macro... (cached) yes checking whether utimensat is declared without a macro... (cached) yes checking whether waitpid is declared without a macro... yes checking whether chdir is declared without a macro... yes checking whether chown is declared without a macro... yes checking whether dup is declared without a macro... yes checking whether dup2 is declared without a macro... yes checking whether dup3 is declared without a macro... yes checking whether environ is declared without a macro... yes checking whether euidaccess is declared without a macro... yes checking whether faccessat is declared without a macro... yes checking whether fchdir is declared without a macro... yes checking whether fchownat is declared without a macro... yes checking whether fdatasync is declared without a macro... yes checking whether fsync is declared without a macro... yes checking whether ftruncate is declared without a macro... yes checking whether getcwd is declared without a macro... yes checking whether getdomainname is declared without a macro... yes checking whether getdtablesize is declared without a macro... yes checking whether getgroups is declared without a macro... yes checking whether gethostname is declared without a macro... yes checking whether getlogin is declared without a macro... yes checking whether getlogin_r is declared without a macro... yes checking whether getpagesize is declared without a macro... yes checking whether getusershell is declared without a macro... yes checking whether setusershell is declared without a macro... yes checking whether endusershell is declared without a macro... yes checking whether group_member is declared without a macro... yes checking whether isatty is declared without a macro... yes checking whether lchown is declared without a macro... yes checking whether link is declared without a macro... yes checking whether linkat is declared without a macro... yes checking whether lseek is declared without a macro... yes checking whether pipe is declared without a macro... yes checking whether pipe2 is declared without a macro... yes checking whether pread is declared without a macro... yes checking whether pwrite is declared without a macro... yes checking whether readlink is declared without a macro... yes checking whether readlinkat is declared without a macro... yes checking whether rmdir is declared without a macro... yes checking whether sethostname is declared without a macro... yes checking whether sleep is declared without a macro... yes checking whether symlink is declared without a macro... yes checking whether symlinkat is declared without a macro... yes checking whether ttyname_r is declared without a macro... yes checking whether unlink is declared without a macro... yes checking whether unlinkat is declared without a macro... yes checking whether usleep is declared without a macro... yes checking for ptrdiff_t... yes checking for vasprintf... yes checking whether btowc is declared without a macro... yes checking whether wctob is declared without a macro... yes checking whether mbsinit is declared without a macro... yes checking whether mbrtowc is declared without a macro... yes checking whether mbrlen is declared without a macro... yes checking whether mbsrtowcs is declared without a macro... yes checking whether mbsnrtowcs is declared without a macro... yes checking whether wcrtomb is declared without a macro... yes checking whether wcsrtombs is declared without a macro... yes checking whether wcsnrtombs is declared without a macro... yes checking whether wcwidth is declared without a macro... yes checking whether wmemchr is declared without a macro... yes checking whether wmemcmp is declared without a macro... yes checking whether wmemcpy is declared without a macro... yes checking whether wmemmove is declared without a macro... yes checking whether wmemset is declared without a macro... yes checking whether wcslen is declared without a macro... yes checking whether wcsnlen is declared without a macro... yes checking whether wcscpy is declared without a macro... yes checking whether wcpcpy is declared without a macro... yes checking whether wcsncpy is declared without a macro... yes checking whether wcpncpy is declared without a macro... yes checking whether wcscat is declared without a macro... yes checking whether wcsncat is declared without a macro... yes checking whether wcscmp is declared without a macro... yes checking whether wcsncmp is declared without a macro... yes checking whether wcscasecmp is declared without a macro... yes checking whether wcsncasecmp is declared without a macro... yes checking whether wcscoll is declared without a macro... yes checking whether wcsxfrm is declared without a macro... yes checking whether wcsdup is declared without a macro... yes checking whether wcschr is declared without a macro... yes checking whether wcsrchr is declared without a macro... yes checking whether wcscspn is declared without a macro... yes checking whether wcsspn is declared without a macro... yes checking whether wcspbrk is declared without a macro... yes checking whether wcsstr is declared without a macro... yes checking whether wcstok is declared without a macro... yes checking whether wcswidth is declared without a macro... yes checking whether iswcntrl works... yes checking for towlower... yes checking for wctype_t... yes checking for wctrans_t... yes checking whether wctype is declared without a macro... yes checking whether iswctype is declared without a macro... yes checking whether wctrans is declared without a macro... yes checking whether towctrans is declared without a macro... yes checking for stdint.h... (cached) yes checking for long long int... (cached) yes checking whether btowc(0) is correct... yes checking whether btowc(EOF) is correct... guessing yes checking for a traditional french locale... (cached) none checking for a french Unicode locale... (cached) none checking for a traditional french locale... (cached) none checking for a turkish Unicode locale... none checking whether fdopen sets errno... yes checking for getpagesize... yes checking whether getpagesize is declared... (cached) yes checking whether byte ordering is bigendian... yes checking for library containing inet_pton... none required checking whether inet_pton is declared... (cached) yes checking whether byte ordering is bigendian... (cached) yes checking whether INT32_MAX < INTMAX_MAX... yes checking whether INT64_MAX == LONG_MAX... no checking whether UINT32_MAX < UINTMAX_MAX... yes checking whether UINT64_MAX == ULONG_MAX... no checking for ioctl... yes checking for ioctl with POSIX signature... no checking for setlocale... yes checking for uselocale... yes checking for a traditional french locale... (cached) none checking for a french Unicode locale... (cached) none checking for a traditional japanese locale... (cached) none checking for a transitional chinese locale... (cached) none checking for a french Unicode locale... (cached) none checking for a traditional french locale... (cached) none checking for a french Unicode locale... (cached) none checking for a traditional japanese locale... (cached) none checking for a transitional chinese locale... (cached) none checking for mmap... (cached) yes checking for MAP_ANONYMOUS... yes checking for mmap... (cached) yes checking for MAP_ANONYMOUS... yes checking for mmap... (cached) yes checking for MAP_ANONYMOUS... yes checking for library containing nanosleep... none required checking for working nanosleep... yes checking for getppriv... no checking whether program_invocation_name is declared... yes checking whether program_invocation_short_name is declared... yes checking for putenv compatible with GNU and SVID... yes checking for mmap... (cached) yes checking for MAP_ANONYMOUS... yes checking for mmap... (cached) yes checking for MAP_ANONYMOUS... yes checking whether rmdir works... yes checking for a traditional french locale... (cached) none checking for a french Unicode locale... (cached) none checking for a traditional japanese locale... (cached) none checking for a transitional chinese locale... (cached) none checking for struct sigaction.sa_sigaction... yes checking for sigprocmask... (cached) yes checking for mmap... (cached) yes checking for MAP_ANONYMOUS... yes checking whether <sys/ioctl.h> declares ioctl... yes checking whether ioctl is declared without a macro... yes checking for pthread_atfork... yes checking whether unlink honors trailing slashes... yes checking whether unlink of a parent directory fails as it should... guessing yes checking for unsetenv... yes checking for unsetenv() return type... int checking whether unsetenv obeys POSIX... yes checking whether mbrtowc handles incomplete characters... (cached) guessing yes checking whether mbrtowc works as well as mbtowc... (cached) guessing yes checking whether wcrtomb return value is correct... guessing yes checking for a traditional french locale... (cached) none checking for a french Unicode locale... (cached) none checking for a traditional japanese locale... (cached) none checking for a transitional chinese locale... (cached) none checking whether wctob works... guessing yes checking whether wctob is declared... (cached) yes checking for sched_yield in -lrt... yes checking how to print strings... printf checking for a sed that does not truncate output... (cached) /bin/sed checking for fgrep... /bin/grep -F checking for ld used by gcc -std=gnu99... /usr/bin/ld checking if the linker (/usr/bin/ld) is GNU ld... yes checking for BSD- or MS-compatible name lister (nm)... /usr/bin/nm -B checking the name lister (/usr/bin/nm -B) interface... BSD nm checking whether ln -s works... yes checking the maximum length of command line arguments... 1572864 checking whether the shell understands some XSI constructs... yes checking whether the shell understands "+="... yes checking how to convert powerpc64-unknown-linux-gnu file names to powerpc64-unknown-linux-gnu format... func_convert_file_noop checking how to convert powerpc64-unknown-linux-gnu file names to toolchain format... func_convert_file_noop checking for /usr/bin/ld option to reload object files... -r checking for objdump... objdump checking how to recognize dependent libraries... pass_all checking for dlltool... no checking how to associate runtime and link libraries... printf %s\n checking for archiver @FILE support... @ checking for strip... strip checking for ranlib... (cached) ranlib checking command to parse /usr/bin/nm -B output from gcc -std=gnu99 object... ok checking for sysroot... no checking for mt... mt checking if mt is a manifest tool... no checking for dlfcn.h... yes checking for objdir... .libs checking if gcc -std=gnu99 supports -fno-rtti -fno-exceptions... no checking for gcc -std=gnu99 option to produce PIC... -fPIC -DPIC checking if gcc -std=gnu99 PIC flag -fPIC -DPIC works... yes checking if gcc -std=gnu99 static flag -static works... yes checking if gcc -std=gnu99 supports -c -o file.o... yes checking if gcc -std=gnu99 supports -c -o file.o... (cached) yes checking whether the gcc -std=gnu99 linker (/usr/bin/ld -m elf32ppclinux) supports shared libraries... yes checking whether -lc should be explicitly linked in... no checking dynamic linker characteristics... GNU/Linux ld.so checking how to hardcode library paths into programs... immediate checking whether stripping libraries is possible... yes checking if libtool supports shared libraries... yes checking whether to build shared libraries... yes checking whether to build static libraries... yes checking whether ln -s works... yes checking for a sed that does not truncate output... (cached) /bin/sed checking for gcc -std=gnu99 option to accept ISO C99... (cached) -std=gnu99 checking for gcc -std=gnu99 -std=gnu99 option to accept ISO Standard C... (cached) -std=gnu99 checking how to run the C preprocessor... gcc -E checking for function prototypes... yes checking for special C compiler options needed for large files... (cached) no checking for _FILE_OFFSET_BITS value needed for large files... (cached) 64 checking size of long... 4 checking if __attribute__((cleanup(...))) works with this compiler... yes checking for dirent.h that defines DIR... yes checking for library containing opendir... none required checking for struct dirent.d_type... yes checking for struct stat.st_blocks... yes checking for struct stat.st_blksize... yes checking whether program_invocation_short_name is declared... (cached) yes checking attr/xattr.h usability... yes checking attr/xattr.h presence... yes checking for attr/xattr.h... yes checking for byteswap.h... (cached) yes checking endian.h usability... yes checking endian.h presence... yes checking for endian.h... yes checking errno.h usability... yes checking errno.h presence... yes checking for errno.h... yes checking linux/fs.h usability... yes checking linux/fs.h presence... yes checking for linux/fs.h... yes checking linux/raid/md_u.h usability... yes checking linux/raid/md_u.h presence... yes checking for linux/raid/md_u.h... yes checking printf.h usability... yes checking printf.h presence... yes checking for printf.h... yes checking sys/inotify.h usability... yes checking sys/inotify.h presence... yes checking for sys/inotify.h... yes checking for sys/socket.h... (cached) yes checking sys/statvfs.h usability... yes checking sys/statvfs.h presence... yes checking for sys/statvfs.h... yes checking for sys/types.h... (cached) yes checking sys/un.h usability... yes checking sys/un.h presence... yes checking for sys/un.h... yes checking for sys/wait.h... (cached) yes checking windows.h usability... no checking windows.h presence... no checking for windows.h... no checking sys/xattr.h usability... yes checking sys/xattr.h presence... yes checking for sys/xattr.h... yes checking for be32toh... no checking for fsync... yes checking for futimens... (cached) yes checking for getxattr... yes checking for htonl... yes checking for htons... yes checking for inotify_init1... yes checking for lgetxattr... yes checking for listxattr... yes checking for llistxattr... yes checking for lsetxattr... yes checking for lremovexattr... yes checking for mknod... yes checking for ntohl... yes checking for ntohs... yes checking for posix_fallocate... yes checking for posix_fadvise... yes checking for realpath... yes checking for removexattr... yes checking for setitimer... yes checking for setxattr... yes checking for sigaction... (cached) yes checking for statvfs... yes checking for sync... yes checking for tgetent in -lncurses... yes checking for tputs in -lncurses... yes checking for UP in -lncurses... yes checking for xgettext... no checking for msgcat... no checking for msgfmt... no checking for msgmerge... no checking msgfmt is GNU tool... no checking if we should build the daemon... yes checking if we should install the daemon... no checking if we should run the daemon under valgrind... no checking which of /sbin /usr/sbin /bin /usr/bin is a real directory... /sbin checking for register_printf_specifier... yes checking if we should build the appliance... yes checking for supermin... /usr/bin/supermin checking for --with-supermin-packager-config option... not set checking for --with-supermin-extra-options option... not set checking supermin is new enough... 5.1 checking which Linux distro for package names... UBUNTU checking for rpcgen... rpcgen checking for xdrmem_create in -lportablexdr... no checking for library containing xdrmem_create... none required checking for library containing xdr_u_int64_t... no checking for library containing xdr_uint64_t... none required checking selinux/selinux.h usability... yes checking selinux/selinux.h presence... yes checking for selinux/selinux.h... yes checking for setexeccon in -lselinux... yes checking for setcon... yes checking for getcon... yes checking sys/sdt.h usability... no checking sys/sdt.h presence... no checking for sys/sdt.h... no checking for cpio... cpio checking for gperf... gperf checking for perl... perl checking for Pod::Man... yes checking for Pod::Simple... yes checking for genisoimage... /usr/bin/genisoimage checking for xmllint... no checking for po4a... no checking for db_dump... no checking for db5.1_dump... no checking for db4_dump... no checking for db4.8_dump... no checking for db4.7_dump... no checking for db4.6_dump... no checking for db_load... no checking for db5.1_load... no checking for db4_load... no checking for db4.8_load... no checking for db4.7_load... no checking for db4.6_load... no checking for pbmtext... no checking for pnmtopng... no checking for bmptopnm... no checking for pamcut... no checking for wrestool... no checking for xzcat... /usr/bin/xzcat checking for pkg-config... /usr/bin/pkg-config checking pkg-config is at least version 0.9.0... yes checking for LIBLZMA... yes checking for lzma_index_stream_flags... yes checking for lzma_index_stream_padding... yes checking for flex... flex checking lex output file root... lex.yy checking lex library... -lfl checking whether yytext is a pointer... yes checking for bison... bison -y checking for qemu-kvm... no checking for kvm... /usr/bin/kvm checking if the user specified extra options for qemu command line... no checking that /usr/bin/kvm -help works... yes checking that /usr/bin/kvm -version works... yes checking for /usr/bin/kvm version >= 1... yes checking what extra options we need to use for qemu feature tests... -machine accel=kvm:tcg -display none checking that /usr/bin/kvm -machine accel=kvm:tcg -display none -device ? works... yes checking for virtio-serial support in /usr/bin/kvm... yes checking for main in -lreadline... no checking for append_history... no checking for completion_matches... no checking for rl_completion_matches... no checking for PCRE... yes checking for AUGEAS... yes checking for magic_file in -lmagic... yes checking magic.h usability... yes checking magic.h presence... yes checking for magic.h... yes checking for acl_from_text in -lacl... yes checking sys/acl.h usability... yes checking sys/acl.h presence... yes checking for sys/acl.h... yes checking for cap_from_text in -lcap... yes checking sys/capability.h usability... yes checking sys/capability.h presence... yes checking for sys/capability.h... yes checking for LIBVIRT... yes checking for LIBXML2... yes checking for xmlBufferDetach... yes checking for LIBCONFIG... yes checking for HIVEX... yes checking for SD_JOURNAL... yes checking for FUSE... yes checking for fuse_opt_add_opt_escaped... yes checking for YAJL... yes checking for g++... g++ checking whether we are using the GNU C++ compiler... yes checking whether g++ accepts -g... yes checking dependency style of g++... gcc3 checking how to run the C++ preprocessor... g++ -E checking for ld used by g++... /usr/bin/ld -m elf32ppclinux checking if the linker (/usr/bin/ld -m elf32ppclinux) is GNU ld... yes checking whether the g++ linker (/usr/bin/ld -m elf32ppclinux) supports shared libraries... yes checking for g++ option to produce PIC... -fPIC -DPIC checking if g++ PIC flag -fPIC -DPIC works... yes checking if g++ static flag -static works... yes checking if g++ supports -c -o file.o... yes checking if g++ supports -c -o file.o... (cached) yes checking whether the g++ linker (/usr/bin/ld -m elf32ppclinux) supports shared libraries... yes checking dynamic linker characteristics... (cached) GNU/Linux ld.so checking how to hardcode library paths into programs... immediate checking if the C++ compiler really really works... yes checking for valgrind... no checking for ocamlc... ocamlc OCaml version is 3.12.1 OCaml library path is /usr/lib/ocaml checking for ocamlopt... ocamlopt checking for ocamlc.opt... no checking for ocamlopt.opt... no checking for ocamldep... ocamldep checking for ocamlmktop... ocamlmktop checking for ocamlmklib... ocamlmklib checking for ocamldoc... ocamldoc checking for ocamlbuild... ocamlbuild checking for ocamlfind... no checking for caml/unixsupport.h... yes checking for OCaml findlib package gettext... not found configure: creating mllib/common_gettext.ml checking for ocaml-gettext... no checking for Test::More... yes checking for ExtUtils::MakeMaker... yes checking for python... python checking Python version... 2.7 checking for PYTHON... yes checking Python prefix... /usr checking for Python site-packages path... /usr/lib/python2.7/dist-packages checking for Python extension suffix (PEP-3149)... .so checking for PyCapsule_New in -lc... yes checking for PyString_AsString in -lc... yes checking for ruby... ruby checking for rake... no checking for C library for Ruby extensions... -lruby-1.9.1 checking for ruby_init in -lruby-1.9.1... no checking for ghc... no checking for php... php checking for phpize... no checking for erlc... /usr/bin/erlc checking for erl... /usr/bin/erl checking for Erlang/OTP 'erl_interface' library subdirectory... /usr/lib/erlang/lib/erl_interface-3.7.13 checking for Erlang/OTP 'erl_interface' library version... 3.7.13 checking for erlc... /usr/bin/erlc checking for erl... /usr/bin/erl checking for Erlang/OTP library base directory... /usr/lib/erlang/lib checking for lua... no checking for go... no checking for Pod::Usage... yes checking for Getopt::Long... yes checking for Sys::Virt... no checking for Locale::TextDomain... no checking for Win::Hivex... no checking for Win::Hivex::Regedit... no configure: WARNING: some Perl modules required to compile the Perl virt-* tools are missing checking for GOBJECT... yes checking for GIO... yes checking for gjs... gjs checking for gobject-introspection... no checking for gtkdoc-check... no checking for gtkdoc-rebase... no checking for gtkdoc-mkpdf... no checking whether to build gtk-doc documentation... no checking for BASH_COMPLETION... yes checking for bash-completions directory... /usr/share/bash-completion/completions checking if we should run the GNUlib tests... yes checking that generated files are newer than configure... done configure: creating ./config.status config.status: creating appliance/libguestfs-make-fixed-appliance config.status: creating inspector/test-xmllint.sh config.status: creating php/extension/php-for-tests.sh config.status: creating pick-guests.pl config.status: creating podwrapper.pl config.status: creating run config.status: creating Makefile config.status: creating align/Makefile config.status: creating appliance/Makefile config.status: creating bash/Makefile config.status: creating builder/Makefile config.status: creating builder/libguestfs.conf config.status: creating builder/test-config/virt-builder/repos.d/test-index.conf config.status: creating builder/test-website/virt-builder/repos.d/libguestfs.conf config.status: creating builder/website/Makefile config.status: creating cat/Makefile config.status: creating csharp/Makefile config.status: creating customize/Makefile config.status: creating daemon/Makefile config.status: creating df/Makefile config.status: creating diff/Makefile config.status: creating edit/Makefile config.status: creating erlang/Makefile config.status: creating erlang/examples/Makefile config.status: creating examples/Makefile config.status: creating fish/Makefile config.status: creating format/Makefile config.status: creating fuse/Makefile config.status: creating generator/Makefile config.status: creating gnulib/lib/Makefile config.status: creating gnulib/tests/Makefile config.status: creating gobject/libguestfs-gobject-1.0.pc config.status: creating gobject/Makefile config.status: creating gobject/docs/Makefile config.status: creating gobject/docs/guestfs-docs.sgml config.status: creating golang/Makefile config.status: creating golang/examples/Makefile config.status: creating haskell/Makefile config.status: creating inspector/Makefile config.status: creating java/Makefile config.status: creating java/examples/Makefile config.status: creating lua/Makefile config.status: creating lua/examples/Makefile config.status: creating make-fs/Makefile config.status: creating mllib/Makefile config.status: creating mllib/config.ml config.status: creating ocaml/META config.status: creating ocaml/Makefile config.status: creating ocaml/examples/Makefile config.status: creating perl/Makefile config.status: creating perl/Makefile.PL config.status: creating perl/examples/Makefile config.status: creating php/Makefile config.status: creating po-docs/Makefile config.status: creating po-docs/ja/Makefile config.status: creating po-docs/uk/Makefile config.status: creating po/Makefile config.status: creating python/Makefile config.status: creating python/examples/Makefile config.status: creating rescue/Makefile config.status: creating resize/Makefile config.status: creating ruby/Makefile config.status: creating ruby/Rakefile config.status: creating ruby/examples/Makefile config.status: creating ruby/ext/guestfs/extconf.rb config.status: creating sparsify/Makefile config.status: creating src/Makefile config.status: creating src/libguestfs.pc config.status: creating sysprep/Makefile config.status: creating test-tool/Makefile config.status: creating tests/9p/Makefile config.status: creating tests/bigdirs/Makefile config.status: creating tests/btrfs/Makefile config.status: creating tests/c-api/Makefile config.status: creating tests/charsets/Makefile config.status: creating tests/create/Makefile config.status: creating tests/data/Makefile config.status: creating tests/discard/Makefile config.status: creating tests/disks/Makefile config.status: creating tests/disks/test-qemu-drive-libvirt.xml config.status: creating tests/disk-labels/Makefile config.status: creating tests/events/Makefile config.status: creating tests/fuzz/Makefile config.status: creating tests/guests/Makefile config.status: creating tests/guests/guests.xml config.status: creating tests/hotplug/Makefile config.status: creating tests/http/Makefile config.status: creating tests/journal/Makefile config.status: creating tests/luks/Makefile config.status: creating tests/lvm/Makefile config.status: creating tests/md/Makefile config.status: creating tests/mount-local/Makefile config.status: creating tests/mountable/Makefile config.status: creating tests/nbd/Makefile config.status: creating tests/network/Makefile config.status: creating tests/ntfsclone/Makefile config.status: creating tests/parallel/Makefile config.status: creating tests/protocol/Makefile config.status: creating tests/qemu/Makefile config.status: creating tests/regressions/Makefile config.status: creating tests/relative-paths/Makefile config.status: creating tests/rsync/Makefile config.status: creating tests/selinux/Makefile config.status: creating tests/syslinux/Makefile config.status: creating tests/tmpdirs/Makefile config.status: creating tests/xfs/Makefile config.status: creating tests/xml/Makefile config.status: creating tools/Makefile config.status: creating config.h config.status: executing depfiles commands config.status: executing libtool commands ------------------------------------------------------------ Thank you for downloading libguestfs 1.26.1 This is how we have configured the optional components for you today: Daemon .............................. yes Appliance ........................... yes QEMU ................................ /usr/bin/kvm guestfish and C-based virt tools .... yes FUSE filesystem ..................... yes GNU gettext for i18n ................ no OCaml bindings ...................... no OCaml-based virt tools .............. no Perl bindings ....................... yes Perl-based virt tools ............... no Python bindings ..................... yes Ruby bindings ....................... no Java bindings ....................... no Haskell bindings .................... no PHP bindings ........................ no Erlang bindings ..................... yes Lua bindings ........................ no Go bindings ......................... no gobject bindings .................... yes gobject introspection ............... no bash completion ..................... yes If any optional component is configured 'no' when you expected 'yes' then you should check the preceding messages. Please report bugs back to the mailing list: http://www.redhat.com/mailman/listinfo/libguestfs Next you should type 'make' to build the package, then 'make check' to run the tests. Or run 'make help' to list some common targets. On Thu, May 29, 2014 at 9:27 PM, Richard W.M. Jones <rjones@redhat.com> wrote:
On Thu, May 29, 2014 at 09:23:56PM +0530, abhishek jain wrote:
Hi Rich
Yes Rich I have tried libguesftfs on powerpc and it was working fine.For some reason i had to format my hard disk and now when I'm again compiling it,I'm getting following error....
Below is the status of configure ..
This is how we have configured the optional components for you today:
Daemon .............................. yes Appliance ........................... yes
I need to see the entire output of configure.
You could also do:
make V=1
and add all of that output too.
Rich.
-- Richard Jones, Virtualization Group, Red Hat http://people.redhat.com/~rjones Read my programming and virtualization blog: http://rwmj.wordpress.com virt-df lists disk usage of guests without needing to install any software inside the virtual machine. Supports Linux and Windows. http://people.redhat.com/~rjones/virt-df/
Here are the another logs.. sudo make V=1 fatal: Not a git repository (or any of the parent directories): .git make all-recursive make[1]: Entering directory `/home/ubuntu/libguestfs-1.26.1' Making all in gnulib/lib make[2]: Entering directory `/home/ubuntu/libguestfs-1.26.1/gnulib/lib' make all-recursive make[3]: Entering directory `/home/ubuntu/libguestfs-1.26.1/gnulib/lib' make[4]: Entering directory `/home/ubuntu/libguestfs-1.26.1/gnulib/lib' make[4]: Nothing to be done for `all-am'. make[4]: Leaving directory `/home/ubuntu/libguestfs-1.26.1/gnulib/lib' make[3]: Leaving directory `/home/ubuntu/libguestfs-1.26.1/gnulib/lib' make[2]: Leaving directory `/home/ubuntu/libguestfs-1.26.1/gnulib/lib' Making all in gnulib/tests make[2]: Entering directory `/home/ubuntu/libguestfs-1.26.1/gnulib/tests' make all-recursive make[3]: Entering directory `/home/ubuntu/libguestfs-1.26.1/gnulib/tests' Making all in . make[4]: Entering directory `/home/ubuntu/libguestfs-1.26.1/gnulib/tests' make[4]: Nothing to be done for `all-am'. make[4]: Leaving directory `/home/ubuntu/libguestfs-1.26.1/gnulib/tests' make[3]: Leaving directory `/home/ubuntu/libguestfs-1.26.1/gnulib/tests' make[2]: Leaving directory `/home/ubuntu/libguestfs-1.26.1/gnulib/tests' Making all in tests/data make[2]: Entering directory `/home/ubuntu/libguestfs-1.26.1/tests/data' make[2]: Nothing to be done for `all'. make[2]: Leaving directory `/home/ubuntu/libguestfs-1.26.1/tests/data' Making all in generator make[2]: Entering directory `/home/ubuntu/libguestfs-1.26.1/generator' make[2]: Nothing to be done for `all'. make[2]: Leaving directory `/home/ubuntu/libguestfs-1.26.1/generator' Making all in src make[2]: Entering directory `/home/ubuntu/libguestfs-1.26.1/src' make all-am make[3]: Entering directory `/home/ubuntu/libguestfs-1.26.1/src' make[3]: Nothing to be done for `all-am'. make[3]: Leaving directory `/home/ubuntu/libguestfs-1.26.1/src' make[2]: Leaving directory `/home/ubuntu/libguestfs-1.26.1/src' Making all in examples make[2]: Entering directory `/home/ubuntu/libguestfs-1.26.1/examples' make[2]: Nothing to be done for `all'. make[2]: Leaving directory `/home/ubuntu/libguestfs-1.26.1/examples' Making all in po make[2]: Entering directory `/home/ubuntu/libguestfs-1.26.1/po' make[2]: Nothing to be done for `all'. make[2]: Leaving directory `/home/ubuntu/libguestfs-1.26.1/po' Making all in daemon make[2]: Entering directory `/home/ubuntu/libguestfs-1.26.1/daemon' make -C ../src guestfs_protocol.c make[3]: Entering directory `/home/ubuntu/libguestfs-1.26.1/src' make[3]: `guestfs_protocol.c' is up to date. make[3]: Leaving directory `/home/ubuntu/libguestfs-1.26.1/src' make -C ../src guestfs_protocol.h make[3]: Entering directory `/home/ubuntu/libguestfs-1.26.1/src' make[3]: `guestfs_protocol.h' is up to date. make[3]: Leaving directory `/home/ubuntu/libguestfs-1.26.1/src' make all-am make[3]: Entering directory `/home/ubuntu/libguestfs-1.26.1/daemon' make -C ../src guestfs_protocol.c make[4]: Entering directory `/home/ubuntu/libguestfs-1.26.1/src' make[4]: `guestfs_protocol.c' is up to date. make[4]: Leaving directory `/home/ubuntu/libguestfs-1.26.1/src' make -C ../src guestfs_protocol.h make[4]: Entering directory `/home/ubuntu/libguestfs-1.26.1/src' make[4]: `guestfs_protocol.h' is up to date. make[4]: Leaving directory `/home/ubuntu/libguestfs-1.26.1/src' make[3]: Leaving directory `/home/ubuntu/libguestfs-1.26.1/daemon' make[2]: Leaving directory `/home/ubuntu/libguestfs-1.26.1/daemon' Making all in appliance make[2]: Entering directory `/home/ubuntu/libguestfs-1.26.1/appliance' cd .. && \ ./config.status --file=appliance/make.sh-t:appliance/make.sh.in config.status: creating appliance/make.sh-t chmod +x make.sh-t cmp -s make.sh make.sh-t || mv make.sh-t make.sh rm -f make.sh-t m4 -DUBUNTU=1 -DEXTRA_PACKAGES="" packagelist.in | \ grep -v '^[[:space:]]*$' | grep -v '^#' > packagelist-t cmp -s packagelist packagelist-t || mv packagelist-t packagelist rm -f packagelist-t make[2]: Leaving directory `/home/ubuntu/libguestfs-1.26.1/appliance' Making all in tests/qemu make[2]: Entering directory `/home/ubuntu/libguestfs-1.26.1/tests/qemu' make[2]: Nothing to be done for `all'. make[2]: Leaving directory `/home/ubuntu/libguestfs-1.26.1/tests/qemu' Making all in tests/guests make[2]: Entering directory `/home/ubuntu/libguestfs-1.26.1/tests/guests' make[2]: Nothing to be done for `all'. make[2]: Leaving directory `/home/ubuntu/libguestfs-1.26.1/tests/guests' Making all in tests/c-api make[2]: Entering directory `/home/ubuntu/libguestfs-1.26.1/tests/c-api' make all-am make[3]: Entering directory `/home/ubuntu/libguestfs-1.26.1/tests/c-api' make[3]: Nothing to be done for `all-am'. make[3]: Leaving directory `/home/ubuntu/libguestfs-1.26.1/tests/c-api' make[2]: Leaving directory `/home/ubuntu/libguestfs-1.26.1/tests/c-api' Making all in tests/tmpdirs make[2]: Entering directory `/home/ubuntu/libguestfs-1.26.1/tests/tmpdirs' make[2]: Nothing to be done for `all'. make[2]: Leaving directory `/home/ubuntu/libguestfs-1.26.1/tests/tmpdirs' Making all in tests/protocol make[2]: Entering directory `/home/ubuntu/libguestfs-1.26.1/tests/protocol' make[2]: Nothing to be done for `all'. make[2]: Leaving directory `/home/ubuntu/libguestfs-1.26.1/tests/protocol' Making all in tests/events make[2]: Entering directory `/home/ubuntu/libguestfs-1.26.1/tests/events' make[2]: Nothing to be done for `all'. make[2]: Leaving directory `/home/ubuntu/libguestfs-1.26.1/tests/events' Making all in tests/parallel make[2]: Entering directory `/home/ubuntu/libguestfs-1.26.1/tests/parallel' make[2]: Nothing to be done for `all'. make[2]: Leaving directory `/home/ubuntu/libguestfs-1.26.1/tests/parallel' Making all in tests/create make[2]: Entering directory `/home/ubuntu/libguestfs-1.26.1/tests/create' make[2]: Nothing to be done for `all'. make[2]: Leaving directory `/home/ubuntu/libguestfs-1.26.1/tests/create' Making all in tests/disks make[2]: Entering directory `/home/ubuntu/libguestfs-1.26.1/tests/disks' make[2]: Nothing to be done for `all'. make[2]: Leaving directory `/home/ubuntu/libguestfs-1.26.1/tests/disks' Making all in tests/discard make[2]: Entering directory `/home/ubuntu/libguestfs-1.26.1/tests/discard' make[2]: Nothing to be done for `all'. make[2]: Leaving directory `/home/ubuntu/libguestfs-1.26.1/tests/discard' Making all in tests/mountable make[2]: Entering directory `/home/ubuntu/libguestfs-1.26.1/tests/mountable' make[2]: Nothing to be done for `all'. make[2]: Leaving directory `/home/ubuntu/libguestfs-1.26.1/tests/mountable' Making all in tests/network make[2]: Entering directory `/home/ubuntu/libguestfs-1.26.1/tests/network' make[2]: Nothing to be done for `all'. make[2]: Leaving directory `/home/ubuntu/libguestfs-1.26.1/tests/network' Making all in tests/lvm make[2]: Entering directory `/home/ubuntu/libguestfs-1.26.1/tests/lvm' make[2]: Nothing to be done for `all'. make[2]: Leaving directory `/home/ubuntu/libguestfs-1.26.1/tests/lvm' Making all in tests/luks make[2]: Entering directory `/home/ubuntu/libguestfs-1.26.1/tests/luks' make[2]: Nothing to be done for `all'. make[2]: Leaving directory `/home/ubuntu/libguestfs-1.26.1/tests/luks' Making all in tests/md make[2]: Entering directory `/home/ubuntu/libguestfs-1.26.1/tests/md' make[2]: Nothing to be done for `all'. make[2]: Leaving directory `/home/ubuntu/libguestfs-1.26.1/tests/md' Making all in tests/selinux make[2]: Entering directory `/home/ubuntu/libguestfs-1.26.1/tests/selinux' make[2]: Nothing to be done for `all'. make[2]: Leaving directory `/home/ubuntu/libguestfs-1.26.1/tests/selinux' Making all in tests/ntfsclone make[2]: Entering directory `/home/ubuntu/libguestfs-1.26.1/tests/ntfsclone' make[2]: Nothing to be done for `all'. make[2]: Leaving directory `/home/ubuntu/libguestfs-1.26.1/tests/ntfsclone' Making all in tests/btrfs make[2]: Entering directory `/home/ubuntu/libguestfs-1.26.1/tests/btrfs' make[2]: Nothing to be done for `all'. make[2]: Leaving directory `/home/ubuntu/libguestfs-1.26.1/tests/btrfs' Making all in tests/xfs make[2]: Entering directory `/home/ubuntu/libguestfs-1.26.1/tests/xfs' make[2]: Nothing to be done for `all'. make[2]: Leaving directory `/home/ubuntu/libguestfs-1.26.1/tests/xfs' Making all in tests/charsets make[2]: Entering directory `/home/ubuntu/libguestfs-1.26.1/tests/charsets' make[2]: Nothing to be done for `all'. make[2]: Leaving directory `/home/ubuntu/libguestfs-1.26.1/tests/charsets' Making all in tests/xml make[2]: Entering directory `/home/ubuntu/libguestfs-1.26.1/tests/xml' make[2]: Nothing to be done for `all'. make[2]: Leaving directory `/home/ubuntu/libguestfs-1.26.1/tests/xml' Making all in tests/mount-local make[2]: Entering directory `/home/ubuntu/libguestfs-1.26.1/tests/mount-local' make[2]: Nothing to be done for `all'. make[2]: Leaving directory `/home/ubuntu/libguestfs-1.26.1/tests/mount-local' Making all in tests/9p make[2]: Entering directory `/home/ubuntu/libguestfs-1.26.1/tests/9p' make[2]: Nothing to be done for `all'. make[2]: Leaving directory `/home/ubuntu/libguestfs-1.26.1/tests/9p' Making all in tests/rsync make[2]: Entering directory `/home/ubuntu/libguestfs-1.26.1/tests/rsync' make[2]: Nothing to be done for `all'. make[2]: Leaving directory `/home/ubuntu/libguestfs-1.26.1/tests/rsync' Making all in tests/bigdirs make[2]: Entering directory `/home/ubuntu/libguestfs-1.26.1/tests/bigdirs' make[2]: Nothing to be done for `all'. make[2]: Leaving directory `/home/ubuntu/libguestfs-1.26.1/tests/bigdirs' Making all in tests/disk-labels make[2]: Entering directory `/home/ubuntu/libguestfs-1.26.1/tests/disk-labels' make[2]: Nothing to be done for `all'. make[2]: Leaving directory `/home/ubuntu/libguestfs-1.26.1/tests/disk-labels' Making all in tests/hotplug make[2]: Entering directory `/home/ubuntu/libguestfs-1.26.1/tests/hotplug' make[2]: Nothing to be done for `all'. make[2]: Leaving directory `/home/ubuntu/libguestfs-1.26.1/tests/hotplug' Making all in tests/nbd make[2]: Entering directory `/home/ubuntu/libguestfs-1.26.1/tests/nbd' make[2]: Nothing to be done for `all'. make[2]: Leaving directory `/home/ubuntu/libguestfs-1.26.1/tests/nbd' Making all in tests/http make[2]: Entering directory `/home/ubuntu/libguestfs-1.26.1/tests/http' make[2]: Nothing to be done for `all'. make[2]: Leaving directory `/home/ubuntu/libguestfs-1.26.1/tests/http' Making all in tests/syslinux make[2]: Entering directory `/home/ubuntu/libguestfs-1.26.1/tests/syslinux' make[2]: Nothing to be done for `all'. make[2]: Leaving directory `/home/ubuntu/libguestfs-1.26.1/tests/syslinux' Making all in tests/journal make[2]: Entering directory `/home/ubuntu/libguestfs-1.26.1/tests/journal' make[2]: Nothing to be done for `all'. make[2]: Leaving directory `/home/ubuntu/libguestfs-1.26.1/tests/journal' Making all in tests/fuzz make[2]: Entering directory `/home/ubuntu/libguestfs-1.26.1/tests/fuzz' make[2]: Nothing to be done for `all'. make[2]: Leaving directory `/home/ubuntu/libguestfs-1.26.1/tests/fuzz' Making all in tests/relative-paths make[2]: Entering directory `/home/ubuntu/libguestfs-1.26.1/tests/relative-paths' make[2]: Nothing to be done for `all'. make[2]: Leaving directory `/home/ubuntu/libguestfs-1.26.1/tests/relative-paths' Making all in tests/regressions make[2]: Entering directory `/home/ubuntu/libguestfs-1.26.1/tests/regressions' make[2]: Nothing to be done for `all'. make[2]: Leaving directory `/home/ubuntu/libguestfs-1.26.1/tests/regressions' Making all in test-tool make[2]: Entering directory `/home/ubuntu/libguestfs-1.26.1/test-tool' make[2]: Nothing to be done for `all'. make[2]: Leaving directory `/home/ubuntu/libguestfs-1.26.1/test-tool' Making all in fish make[2]: Entering directory `/home/ubuntu/libguestfs-1.26.1/fish' make all-am make[3]: Entering directory `/home/ubuntu/libguestfs-1.26.1/fish' bash ../libtool-kill-dependency_libs.sh ../libtool --tag=CC --mode=link gcc -std=gnu99 -std=gnu99 -I/usr/include/libxml2 -g -O2 -o guestfish guestfish-cmds.o guestfish-completion.o guestfish-event-names.o guestfish-prepopts.o guestfish-config.o guestfish-domain.o guestfish-inspect.o guestfish-keys.o guestfish-options.o guestfish-progress.o guestfish-uri.o guestfish-alloc.o guestfish-copy.o guestfish-destpaths.o guestfish-display.o guestfish-echo.o guestfish-edit.o guestfish-events.o guestfish-fish.o guestfish-glob.o guestfish-help.o guestfish-hexedit.o guestfish-lcd.o guestfish-man.o guestfish-more.o guestfish-prep.o guestfish-prep-disk.o guestfish-prep-part.o guestfish-prep-fs.o guestfish-prep-lv.o guestfish-prep-boot.o guestfish-rc.o guestfish-reopen.o guestfish-setenv.o guestfish-supported.o guestfish-tilde.o guestfish-time.o -lconfig ../src/libguestfs.la ../src/ libutils.la -lxml2 -lm libcmds.la librc_protocol.la ../gnulib/lib/ libgnu.la libtool: link: gcc -std=gnu99 -std=gnu99 -I/usr/include/libxml2 -g -O2 -o .libs/guestfish guestfish-cmds.o guestfish-completion.o guestfish-event-names.o guestfish-prepopts.o guestfish-config.o guestfish-domain.o guestfish-inspect.o guestfish-keys.o guestfish-options.o guestfish-progress.o guestfish-uri.o guestfish-alloc.o guestfish-copy.o guestfish-destpaths.o guestfish-display.o guestfish-echo.o guestfish-edit.o guestfish-events.o guestfish-fish.o guestfish-glob.o guestfish-help.o guestfish-hexedit.o guestfish-lcd.o guestfish-man.o guestfish-more.o guestfish-prep.o guestfish-prep-disk.o guestfish-prep-part.o guestfish-prep-fs.o guestfish-prep-lv.o guestfish-prep-boot.o guestfish-rc.o guestfish-reopen.o guestfish-setenv.o guestfish-supported.o guestfish-tilde.o guestfish-time.o -lconfig ../src/.libs/libguestfs.so ../src/.libs/libutils.a -lxml2 -lm ./.libs/libcmds.a ./.libs/librc_protocol.a ../gnulib/lib/.libs/libgnu.a -pthread guestfish-progress.o: In function `progress_bar_init': /home/ubuntu/libguestfs-1.26.1/fish/progress.c:123: undefined reference to `tgetent' guestfish-progress.o: In function `progress_bar_set': /home/ubuntu/libguestfs-1.26.1/fish/progress.c:282: undefined reference to `tgetnum' /home/ubuntu/libguestfs-1.26.1/fish/progress.c:297: undefined reference to `UP' guestfish-progress.o: In function `fprintf': /usr/include/powerpc-linux-gnu/bits/stdio2.h:97: undefined reference to `UP' collect2: error: ld returned 1 exit status make[3]: *** [guestfish] Error 1 make[3]: Leaving directory `/home/ubuntu/libguestfs-1.26.1/fish' make[2]: *** [all] Error 2 make[2]: Leaving directory `/home/ubuntu/libguestfs-1.26.1/fish' make[1]: *** [all-recursive] Error 1 make[1]: Leaving directory `/home/ubuntu/libguestfs-1.26.1' make: *** [all] Error 2 On Thu, May 29, 2014 at 9:30 PM, abhishek jain <ashujain9727@gmail.com> wrote:
Here's the output of configure....
sudo ./configure checking for a BSD-compatible install... /usr/bin/install -c checking whether build environment is sane... yes checking for a thread-safe mkdir -p... /bin/mkdir -p checking for gawk... gawk checking whether make sets $(MAKE)... yes checking whether make supports nested variables... yes checking whether make supports nested variables... (cached) yes checking if 1.26 is a stable or development branch of libguestfs... stable configure: libguestfs version 1.26.1 checking if the user specified a default backend... direct checking for style of include used by make... GNU checking for gcc... gcc checking whether the C compiler works... yes checking for C compiler default output file name... a.out checking for suffix of executables... checking whether we are cross compiling... no checking for suffix of object files... o checking whether we are using the GNU C compiler... yes checking whether gcc accepts -g... yes checking for gcc option to accept ISO C89... none needed checking dependency style of gcc... gcc3 checking how to run the C preprocessor... gcc -E checking for grep that handles long lines and -e... /bin/grep checking for egrep... /bin/grep -E checking for Minix Amsterdam compiler... no checking for ar... ar checking for ranlib... ranlib checking whether gcc and cc understand -c and -o together... yes checking for ANSI C header files... yes checking for sys/types.h... yes checking for sys/stat.h... yes checking for stdlib.h... yes checking for string.h... yes checking for memory.h... yes checking for strings.h... yes checking for inttypes.h... yes checking for stdint.h... yes checking for unistd.h... yes checking minix/config.h usability... no checking minix/config.h presence... no checking for minix/config.h... no checking whether it is safe to define __EXTENSIONS__... yes checking whether _XOPEN_SOURCE should be defined... no checking build system type... powerpc64-unknown-linux-gnu checking host system type... powerpc64-unknown-linux-gnu checking for _LARGEFILE_SOURCE value needed for large files... no checking for special C compiler options needed for large files... no checking for _FILE_OFFSET_BITS value needed for large files... 64 checking for gcc option to accept ISO C99... -std=gnu99 checking for gcc -std=gnu99 option to accept ISO Standard C... (cached) -std=gnu99 checking sys/socket.h usability... yes checking sys/socket.h presence... yes checking for sys/socket.h... yes checking arpa/inet.h usability... yes checking arpa/inet.h presence... yes checking for arpa/inet.h... yes checking features.h usability... yes checking features.h presence... yes checking for features.h... yes checking for unistd.h... (cached) yes checking sys/param.h usability... yes checking sys/param.h presence... yes checking for sys/param.h... yes checking dirent.h usability... yes checking dirent.h presence... yes checking for dirent.h... yes checking wctype.h usability... yes checking wctype.h presence... yes checking for wctype.h... yes checking stdio_ext.h usability... yes checking stdio_ext.h presence... yes checking for stdio_ext.h... yes checking for sys/stat.h... (cached) yes checking sys/vfs.h usability... yes checking sys/vfs.h presence... yes checking for sys/vfs.h... yes checking sys/fs_types.h usability... no checking sys/fs_types.h presence... no checking for sys/fs_types.h... no checking netdb.h usability... yes checking netdb.h presence... yes checking for netdb.h... yes checking netinet/in.h usability... yes checking netinet/in.h presence... yes checking for netinet/in.h... yes checking getopt.h usability... yes checking getopt.h presence... yes checking for getopt.h... yes checking sys/time.h usability... yes checking sys/time.h presence... yes checking for sys/time.h... yes checking sys/cdefs.h usability... yes checking sys/cdefs.h presence... yes checking for sys/cdefs.h... yes checking wchar.h usability... yes checking wchar.h presence... yes checking for wchar.h... yes checking for stdint.h... (cached) yes checking for inttypes.h... (cached) yes checking xlocale.h usability... yes checking xlocale.h presence... yes checking for xlocale.h... yes checking sys/mman.h usability... yes checking sys/mman.h presence... yes checking for sys/mman.h... yes checking sys/select.h usability... yes checking sys/select.h presence... yes checking for sys/select.h... yes checking sys/uio.h usability... yes checking sys/uio.h presence... yes checking for sys/uio.h... yes checking sys/wait.h usability... yes checking sys/wait.h presence... yes checking for sys/wait.h... yes checking utime.h usability... yes checking utime.h presence... yes checking for utime.h... yes checking priv.h usability... no checking priv.h presence... no checking for priv.h... no checking sys/ioctl.h usability... yes checking sys/ioctl.h presence... yes checking for sys/ioctl.h... yes checking whether the preprocessor supports include_next... yes checking whether system header files limit the line length... no checking whether <sys/socket.h> is self-contained... yes checking for shutdown... yes checking whether <sys/socket.h> defines the SHUT_* macros... yes checking for struct sockaddr_storage... yes checking for sa_family_t... yes checking for struct sockaddr_storage.ss_family... yes checking whether socket is declared without a macro... yes checking whether connect is declared without a macro... yes checking whether accept is declared without a macro... yes checking whether bind is declared without a macro... yes checking whether getpeername is declared without a macro... yes checking whether getsockname is declared without a macro... yes checking whether getsockopt is declared without a macro... yes checking whether listen is declared without a macro... yes checking whether recv is declared without a macro... yes checking whether send is declared without a macro... yes checking whether recvfrom is declared without a macro... yes checking whether sendto is declared without a macro... yes checking whether setsockopt is declared without a macro... yes checking whether shutdown is declared without a macro... yes checking whether accept4 is declared without a macro... yes checking for accept4... yes checking for readlinkat... yes checking for _set_invalid_parameter_handler... no checking for fchdir... yes checking for fdopendir... yes checking for dup3... yes checking for setdtablesize... no checking for fcntl... yes checking for symlink... yes checking for mempcpy... yes checking for btowc... yes checking for isblank... yes checking for iswctype... yes checking for mbsrtowcs... yes checking for wmemchr... yes checking for wmemcpy... yes checking for wmempcpy... yes checking for fstatat... yes checking for openat... yes checking for fstatfs... yes checking for futimens... yes checking for getdelim... yes checking for getdtablesize... yes checking for getlogin_r... yes checking for gettimeofday... yes checking for nanotime... no checking for getpwnam_r... yes checking for lstat... yes checking for mbsinit... yes checking for mbrtowc... yes checking for mprotect... yes checking for mkstemps... yes checking for strerror_r... yes checking for __xpg_strerror_r... yes checking for pipe2... yes checking for pread... yes checking for readlink... yes checking for secure_getenv... yes checking for setenv... yes checking for sleep... yes checking for snprintf... yes checking for strdup... yes checking for catgets... yes checking for strndup... yes checking for strtoumax... yes checking for symlinkat... yes checking for pipe... yes checking for futimes... yes checking for futimesat... yes checking for utimensat... yes checking for lutimes... yes checking for vasnprintf... no checking for iswcntrl... yes checking for ftruncate... yes checking for newlocale... yes checking for sigaction... yes checking for sigaltstack... yes checking for siginterrupt... yes checking for shutdown... (cached) yes checking for unlinkat... yes checking for wcrtomb... yes checking for wctob... yes checking for size_t... yes checking for working alloca.h... yes checking for alloca... yes checking whether // is distinct from /... no checking if environ is properly declared... yes checking for complete errno.h... yes checking whether strerror_r is declared... yes checking for strerror_r... (cached) yes checking whether strerror_r returns char *... yes checking whether fchdir is declared... yes checking for working fcntl.h... yes checking for pid_t... yes checking for mode_t... yes checking for promoted mode_t type... mode_t checking for mbstate_t... yes checking whether stat file-mode macros are broken... no checking for nlink_t... yes checking whether fchmodat is declared without a macro... yes checking whether fstat is declared without a macro... yes checking whether fstatat is declared without a macro... yes checking whether futimens is declared without a macro... yes checking whether lchmod is declared without a macro... yes checking whether lstat is declared without a macro... yes checking whether mkdirat is declared without a macro... yes checking whether mkfifo is declared without a macro... yes checking whether mkfifoat is declared without a macro... yes checking whether mknod is declared without a macro... yes checking whether mknodat is declared without a macro... yes checking whether stat is declared without a macro... yes checking whether utimensat is declared without a macro... yes checking whether lstat correctly handles trailing slash... yes checking whether stdin defaults to large file offsets... yes checking whether ftello is declared... yes checking for ftello... yes checking whether ftello works... yes checking whether getaddrinfo is declared without a macro... yes checking whether freeaddrinfo is declared without a macro... yes checking whether gai_strerror is declared without a macro... yes checking whether getnameinfo is declared without a macro... yes checking for library containing gethostbyname... none required checking for gethostbyname... yes checking for library containing getservbyname... none required checking for getservbyname... yes checking for C/C++ restrict keyword... __restrict checking for library containing inet_ntop... none required checking whether inet_ntop is declared... yes checking for IPv4 sockets... yes checking for IPv6 sockets... yes checking whether getcwd (NULL, 0) allocates memory for result... yes checking for getcwd with POSIX signature... yes checking whether getdelim is declared... yes checking whether getline is declared... yes checking whether getlogin_r is declared... yes checking whether getlogin is declared... yes checking for getopt.h... (cached) yes checking for getopt_long_only... yes checking whether getopt is POSIX compatible... yes checking for working GNU getopt function... yes checking for working GNU getopt_long function... yes checking whether getenv is declared... yes checking for struct timeval... yes checking for wide-enough struct timeval.tv_sec member... yes checking whether gettimeofday is declared without a macro... yes checking for unsigned long long int... yes checking for long long int... yes checking whether stdint.h conforms to C99... yes checking whether imaxabs is declared without a macro... yes checking whether imaxdiv is declared without a macro... yes checking whether strtoimax is declared without a macro... yes checking whether strtoumax is declared without a macro... yes checking for nl_langinfo and CODESET... yes checking whether getc_unlocked is declared... yes checking whether we are using the GNU C Library >= 2.1 or uClibc... yes checking for wchar_t... yes checking whether NULL can be used in arbitrary expressions... yes checking for ld used by gcc -std=gnu99... /usr/bin/ld checking if the linker (/usr/bin/ld) is GNU ld... yes checking for shared library run path origin... done checking whether imported symbols can be declared weak... yes checking pthread.h usability... yes checking pthread.h presence... yes checking for pthread.h... yes checking for pthread_kill in -lpthread... yes checking for multithread API to use... posix checking for a sed that does not truncate output... /bin/sed checking whether malloc, realloc, calloc are POSIX compliant... yes checking for stdlib.h... (cached) yes checking for GNU libc compatible malloc... yes checking for a traditional japanese locale... none checking for a transitional chinese locale... none checking for a french Unicode locale... none checking for a traditional french locale... none checking for mmap... yes checking for MAP_ANONYMOUS... yes checking whether memchr works... yes checking whether memmem is declared... yes checking for memmem... yes checking whether memmem works... yes checking whether memrchr is declared... yes checking whether strerror(0) succeeds... yes checking for strerror_r with POSIX signature... no checking whether __xpg_strerror_r works... yes checking whether strerror_r is declared... (cached) yes checking for sigset_t... yes checking for ssize_t... yes checking whether <sys/select.h> is self-contained... yes checking whether pselect is declared without a macro... yes checking whether select is declared without a macro... yes checking for inline... inline checking for library containing setsockopt... none needed checking whether setenv is declared... yes checking search.h usability... yes checking search.h presence... yes checking for search.h... yes checking for tsearch... yes checking for uid_t in sys/types.h... yes checking whether snprintf returns a byte count as in C99... yes checking whether snprintf is declared... yes checking for stdbool.h that conforms to C99... yes checking for _Bool... yes checking whether strdup is declared... yes checking whether ffsl is declared without a macro... yes checking whether ffsll is declared without a macro... yes checking whether memmem is declared without a macro... yes checking whether mempcpy is declared without a macro... yes checking whether memrchr is declared without a macro... yes checking whether rawmemchr is declared without a macro... yes checking whether stpcpy is declared without a macro... yes checking whether stpncpy is declared without a macro... yes checking whether strchrnul is declared without a macro... yes checking whether strdup is declared without a macro... yes checking whether strncat is declared without a macro... yes checking whether strndup is declared without a macro... yes checking whether strnlen is declared without a macro... yes checking whether strpbrk is declared without a macro... yes checking whether strsep is declared without a macro... yes checking whether strcasestr is declared without a macro... yes checking whether strtok_r is declared without a macro... yes checking whether strerror_r is declared without a macro... yes checking whether strsignal is declared without a macro... yes checking whether strverscmp is declared without a macro... yes checking whether strndup is declared... (cached) yes checking whether strnlen is declared... (cached) yes checking whether strtoumax is declared... (cached) yes checking for struct timespec in <time.h>... yes checking whether the utimes function works... yes checking for struct utimbuf... yes checking for wint_t... yes checking for inttypes.h... yes checking for stdint.h... yes checking for intmax_t... yes checking where to find the exponent in a 'double'... word 0 bit 20 checking for snprintf... (cached) yes checking for strnlen... yes checking for wcslen... yes checking for wcsnlen... yes checking for mbrtowc... (cached) yes checking for wcrtomb... (cached) yes checking whether _snprintf is declared... no checking whether <wchar.h> uses 'inline' correctly... yes checking whether ungetc works on arbitrary bytes... yes checking for off_t... yes checking for inttypes.h... (cached) yes checking whether the inttypes.h PRIxNN macros are broken... no checking for LC_MESSAGES... yes checking for CFPreferencesCopyAppValue... no checking for CFLocaleCopyCurrent... no checking whether alarm is declared... yes checking whether unsetenv is declared... yes checking for alloca as a compiler built-in... yes checking whether inet_ntop is declared without a macro... yes checking whether inet_pton is declared without a macro... yes checking byteswap.h usability... yes checking byteswap.h presence... yes checking for byteswap.h... yes checking whether this system has an arbitrary file name length limit... yes checking for library containing clock_gettime... none required checking for clock_gettime... yes checking for clock_settime... yes checking for closedir... yes checking for d_ino member in directory struct... yes checking for d_type member in directory struct... yes checking whether alphasort is declared without a macro... yes checking whether closedir is declared without a macro... yes checking whether dirfd is declared without a macro... yes checking whether fdopendir is declared without a macro... yes checking whether opendir is declared without a macro... yes checking whether readdir is declared without a macro... yes checking whether rewinddir is declared without a macro... yes checking whether scandir is declared without a macro... yes checking for dirfd... yes checking whether dirfd is declared... (cached) yes checking whether dirfd is a macro... no checking whether // is distinct from /... (cached) no checking whether dup2 works... yes checking for error_at_line... yes checking whether fcntl handles F_DUPFD correctly... yes checking whether fcntl understands F_DUPFD_CLOEXEC... needs runtime check checking whether fcntl is declared without a macro... yes checking whether openat is declared without a macro... yes checking whether fdopendir is declared... (cached) yes checking whether fdopendir works... yes checking whether conversion from 'int' to 'long double' works... yes checking for working POSIX fnmatch... yes checking for __fpending... yes checking whether __fpending is declared... yes checking whether fstatat (..., 0) works... yes checking for sys/mount.h... yes configure: checking how to get file system space usage checking for statvfs function (SVR4)... yes checking whether to use statvfs64... no checking for two-argument statfs with statfs.f_frsize member... yes checking dustat.h usability... no checking dustat.h presence... no checking for dustat.h... no checking sys/fs/s5param.h usability... no checking sys/fs/s5param.h presence... no checking for sys/fs/s5param.h... no checking sys/filsys.h usability... no checking sys/filsys.h presence... no checking for sys/filsys.h... no checking sys/statfs.h usability... yes checking sys/statfs.h presence... yes checking for sys/statfs.h... yes checking for statfs that truncates block counts... no checking for ftello... (cached) yes checking whether ftello works... (cached) yes checking for struct statfs.f_type... yes checking whether futimens works... needs runtime check configure: checking how to do getaddrinfo, freeaddrinfo and getnameinfo checking for library containing getaddrinfo... none required checking for getaddrinfo... yes checking whether gai_strerror is declared... (cached) yes checking whether gai_strerrorA is declared... no checking for gai_strerror with POSIX signature... yes checking for struct sockaddr.sa_len... no checking whether getaddrinfo is declared... (cached) yes checking whether freeaddrinfo is declared... (cached) yes checking whether getnameinfo is declared... (cached) yes checking for struct addrinfo... yes checking for working getdelim function... yes checking whether getdtablesize works... yes checking for getline... yes checking for working getline function... yes checking whether getlogin_r works with small buffers... yes checking whether gettimeofday clobbers localtime buffer... no checking for gettimeofday with POSIX signature... almost checking glob.h usability... yes checking glob.h presence... yes checking for glob.h... yes checking for GNU glob interface version 1... yes checking whether glob lists broken symlinks... no checking for library containing gethostbyname... (cached) none required checking for gethostbyname... (cached) yes checking for library containing inet_ntop... (cached) none required checking whether inet_ntop is declared... (cached) yes checking whether locale.h conforms to POSIX:2001... yes checking whether locale.h defines locale_t... yes checking whether struct lconv is properly defined... yes checking whether setlocale is declared without a macro... yes checking whether duplocale is declared without a macro... yes checking for pthread_rwlock_t... yes checking whether lseek detects pipes... yes checking whether mbrtowc handles incomplete characters... guessing yes checking whether mbrtowc works as well as mbtowc... guessing yes checking whether mbrtowc handles a NULL pwc argument... guessing yes checking whether mbrtowc handles a NULL string argument... guessing yes checking whether mbrtowc has a correct return value... guessing yes checking whether mbrtowc returns 0 when parsing a NUL character... guessing yes checking whether mbrtowc handles incomplete characters... (cached) guessing yes checking whether mbrtowc works as well as mbtowc... (cached) guessing yes checking whether mbrtowc handles incomplete characters... (cached) guessing yes checking whether mbrtowc works as well as mbtowc... (cached) guessing yes checking whether mbsrtowcs works... guessing yes checking whether memmem works in linear time... yes checking for memmem... (cached) yes checking whether memmem works... (cached) yes checking for mempcpy... (cached) yes checking for memrchr... yes checking for mkdtemp... yes checking whether getaddrinfo is declared without a macro... (cached) yes checking whether freeaddrinfo is declared without a macro... (cached) yes checking whether gai_strerror is declared without a macro... (cached) yes checking whether getnameinfo is declared without a macro... (cached) yes checking whether <netinet/in.h> is self-contained... yes checking whether open recognizes a trailing slash... yes checking for opendir... yes checking whether perror matches strerror... yes checking whether pread works... yes checking for raise... yes checking for sigprocmask... yes checking for rawmemchr... yes checking for readdir... yes checking whether readlink signature is correct... yes checking whether readlink handles trailing slash correctly... yes checking whether select supports a 0 argument... yes checking whether select detects invalid fds... yes checking for library containing getservbyname... (cached) none required checking for getservbyname... (cached) yes checking whether setenv validates arguments... yes checking for volatile sig_atomic_t... yes checking for sighandler_t... yes checking whether pthread_sigmask is declared without a macro... yes checking whether sigaction is declared without a macro... yes checking whether sigaddset is declared without a macro... yes checking whether sigdelset is declared without a macro... yes checking whether sigemptyset is declared without a macro... yes checking whether sigfillset is declared without a macro... yes checking whether sigismember is declared without a macro... yes checking whether sigpending is declared without a macro... yes checking whether sigprocmask is declared without a macro... yes checking for stdint.h... (cached) yes checking for SIZE_MAX... yes checking whether sleep is declared... yes checking for working sleep... yes checking for snprintf... (cached) yes checking whether snprintf respects a size of 1... yes checking whether printf supports POSIX/XSI format strings with positions... yes checking for library containing setsockopt... (cached) none needed checking for socklen_t... yes checking for ssize_t... (cached) yes checking whether stat handles trailing slashes on directories... yes checking whether stat handles trailing slashes on files... yes checking for struct stat.st_atim.tv_nsec... yes checking whether struct stat.st_atim is of type struct timespec... yes checking for struct stat.st_birthtimespec.tv_nsec... no checking for struct stat.st_birthtimensec... no checking for struct stat.st_birthtim.tv_nsec... no checking for working stdalign.h... yes checking for va_copy... yes checking whether NULL can be used in arbitrary expressions... (cached) yes checking whether dprintf is declared without a macro... yes checking whether fpurge is declared without a macro... no checking whether fseeko is declared without a macro... yes checking whether ftello is declared without a macro... yes checking whether getdelim is declared without a macro... yes checking whether getline is declared without a macro... yes checking whether gets is declared without a macro... no checking whether pclose is declared without a macro... yes checking whether popen is declared without a macro... yes checking whether renameat is declared without a macro... yes checking whether snprintf is declared without a macro... yes checking whether tmpfile is declared without a macro... yes checking whether vdprintf is declared without a macro... yes checking whether vsnprintf is declared without a macro... yes checking whether _Exit is declared without a macro... yes checking whether atoll is declared without a macro... yes checking whether canonicalize_file_name is declared without a macro... yes checking whether getloadavg is declared without a macro... yes checking whether getsubopt is declared without a macro... yes checking whether grantpt is declared without a macro... yes checking whether initstate is declared without a macro... yes checking whether initstate_r is declared without a macro... yes checking whether mkdtemp is declared without a macro... yes checking whether mkostemp is declared without a macro... yes checking whether mkostemps is declared without a macro... yes checking whether mkstemp is declared without a macro... yes checking whether mkstemps is declared without a macro... yes checking whether posix_openpt is declared without a macro... yes checking whether ptsname is declared without a macro... yes checking whether ptsname_r is declared without a macro... yes checking whether random is declared without a macro... yes checking whether random_r is declared without a macro... yes checking whether realpath is declared without a macro... yes checking whether rpmatch is declared without a macro... yes checking whether secure_getenv is declared without a macro... yes checking whether setenv is declared without a macro... yes checking whether setstate is declared without a macro... yes checking whether setstate_r is declared without a macro... yes checking whether srandom is declared without a macro... yes checking whether srandom_r is declared without a macro... yes checking whether strtod is declared without a macro... yes checking whether strtoll is declared without a macro... yes checking whether strtoull is declared without a macro... yes checking whether unlockpt is declared without a macro... yes checking whether unsetenv is declared without a macro... yes checking for strchrnul... yes checking whether strchrnul works... yes checking for working strerror function... yes checking for working strndup... yes checking for working strnlen... yes checking for strtoll... yes checking for strtoull... yes checking whether symlink handles trailing slash correctly... yes checking whether <sys/select.h> is self-contained... (cached) yes checking whether pselect is declared without a macro... (cached) yes checking whether select is declared without a macro... (cached) yes checking whether <sys/socket.h> is self-contained... (cached) yes checking for shutdown... (cached) yes checking whether <sys/socket.h> defines the SHUT_* macros... (cached) yes checking for struct sockaddr_storage... (cached) yes checking for sa_family_t... (cached) yes checking for struct sockaddr_storage.ss_family... (cached) yes checking whether socket is declared without a macro... (cached) yes checking whether connect is declared without a macro... (cached) yes checking whether accept is declared without a macro... (cached) yes checking whether bind is declared without a macro... (cached) yes checking whether getpeername is declared without a macro... (cached) yes checking whether getsockname is declared without a macro... (cached) yes checking whether getsockopt is declared without a macro... (cached) yes checking whether listen is declared without a macro... (cached) yes checking whether recv is declared without a macro... (cached) yes checking whether send is declared without a macro... (cached) yes checking whether recvfrom is declared without a macro... (cached) yes checking whether sendto is declared without a macro... (cached) yes checking whether setsockopt is declared without a macro... (cached) yes checking whether shutdown is declared without a macro... (cached) yes checking whether accept4 is declared without a macro... (cached) yes checking for nlink_t... (cached) yes checking whether fchmodat is declared without a macro... (cached) yes checking whether fstat is declared without a macro... (cached) yes checking whether fstatat is declared without a macro... (cached) yes checking whether futimens is declared without a macro... (cached) yes checking whether lchmod is declared without a macro... (cached) yes checking whether lstat is declared without a macro... (cached) yes checking whether mkdirat is declared without a macro... (cached) yes checking whether mkfifo is declared without a macro... (cached) yes checking whether mkfifoat is declared without a macro... (cached) yes checking whether mknod is declared without a macro... (cached) yes checking whether mknodat is declared without a macro... (cached) yes checking whether stat is declared without a macro... (cached) yes checking whether utimensat is declared without a macro... (cached) yes checking whether waitpid is declared without a macro... yes checking whether chdir is declared without a macro... yes checking whether chown is declared without a macro... yes checking whether dup is declared without a macro... yes checking whether dup2 is declared without a macro... yes checking whether dup3 is declared without a macro... yes checking whether environ is declared without a macro... yes checking whether euidaccess is declared without a macro... yes checking whether faccessat is declared without a macro... yes checking whether fchdir is declared without a macro... yes checking whether fchownat is declared without a macro... yes checking whether fdatasync is declared without a macro... yes checking whether fsync is declared without a macro... yes checking whether ftruncate is declared without a macro... yes checking whether getcwd is declared without a macro... yes checking whether getdomainname is declared without a macro... yes checking whether getdtablesize is declared without a macro... yes checking whether getgroups is declared without a macro... yes checking whether gethostname is declared without a macro... yes checking whether getlogin is declared without a macro... yes checking whether getlogin_r is declared without a macro... yes checking whether getpagesize is declared without a macro... yes checking whether getusershell is declared without a macro... yes checking whether setusershell is declared without a macro... yes checking whether endusershell is declared without a macro... yes checking whether group_member is declared without a macro... yes checking whether isatty is declared without a macro... yes checking whether lchown is declared without a macro... yes checking whether link is declared without a macro... yes checking whether linkat is declared without a macro... yes checking whether lseek is declared without a macro... yes checking whether pipe is declared without a macro... yes checking whether pipe2 is declared without a macro... yes checking whether pread is declared without a macro... yes checking whether pwrite is declared without a macro... yes checking whether readlink is declared without a macro... yes checking whether readlinkat is declared without a macro... yes checking whether rmdir is declared without a macro... yes checking whether sethostname is declared without a macro... yes checking whether sleep is declared without a macro... yes checking whether symlink is declared without a macro... yes checking whether symlinkat is declared without a macro... yes checking whether ttyname_r is declared without a macro... yes checking whether unlink is declared without a macro... yes checking whether unlinkat is declared without a macro... yes checking whether usleep is declared without a macro... yes checking for ptrdiff_t... yes checking for vasprintf... yes checking whether btowc is declared without a macro... yes checking whether wctob is declared without a macro... yes checking whether mbsinit is declared without a macro... yes checking whether mbrtowc is declared without a macro... yes checking whether mbrlen is declared without a macro... yes checking whether mbsrtowcs is declared without a macro... yes checking whether mbsnrtowcs is declared without a macro... yes checking whether wcrtomb is declared without a macro... yes checking whether wcsrtombs is declared without a macro... yes checking whether wcsnrtombs is declared without a macro... yes checking whether wcwidth is declared without a macro... yes checking whether wmemchr is declared without a macro... yes checking whether wmemcmp is declared without a macro... yes checking whether wmemcpy is declared without a macro... yes checking whether wmemmove is declared without a macro... yes checking whether wmemset is declared without a macro... yes checking whether wcslen is declared without a macro... yes checking whether wcsnlen is declared without a macro... yes checking whether wcscpy is declared without a macro... yes checking whether wcpcpy is declared without a macro... yes checking whether wcsncpy is declared without a macro... yes checking whether wcpncpy is declared without a macro... yes checking whether wcscat is declared without a macro... yes checking whether wcsncat is declared without a macro... yes checking whether wcscmp is declared without a macro... yes checking whether wcsncmp is declared without a macro... yes checking whether wcscasecmp is declared without a macro... yes checking whether wcsncasecmp is declared without a macro... yes checking whether wcscoll is declared without a macro... yes checking whether wcsxfrm is declared without a macro... yes checking whether wcsdup is declared without a macro... yes checking whether wcschr is declared without a macro... yes checking whether wcsrchr is declared without a macro... yes checking whether wcscspn is declared without a macro... yes checking whether wcsspn is declared without a macro... yes checking whether wcspbrk is declared without a macro... yes checking whether wcsstr is declared without a macro... yes checking whether wcstok is declared without a macro... yes checking whether wcswidth is declared without a macro... yes checking whether iswcntrl works... yes checking for towlower... yes checking for wctype_t... yes checking for wctrans_t... yes checking whether wctype is declared without a macro... yes checking whether iswctype is declared without a macro... yes checking whether wctrans is declared without a macro... yes checking whether towctrans is declared without a macro... yes checking for stdint.h... (cached) yes checking for long long int... (cached) yes checking whether btowc(0) is correct... yes checking whether btowc(EOF) is correct... guessing yes checking for a traditional french locale... (cached) none checking for a french Unicode locale... (cached) none checking for a traditional french locale... (cached) none checking for a turkish Unicode locale... none checking whether fdopen sets errno... yes checking for getpagesize... yes checking whether getpagesize is declared... (cached) yes checking whether byte ordering is bigendian... yes checking for library containing inet_pton... none required checking whether inet_pton is declared... (cached) yes checking whether byte ordering is bigendian... (cached) yes checking whether INT32_MAX < INTMAX_MAX... yes checking whether INT64_MAX == LONG_MAX... no checking whether UINT32_MAX < UINTMAX_MAX... yes checking whether UINT64_MAX == ULONG_MAX... no checking for ioctl... yes checking for ioctl with POSIX signature... no checking for setlocale... yes checking for uselocale... yes checking for a traditional french locale... (cached) none checking for a french Unicode locale... (cached) none checking for a traditional japanese locale... (cached) none checking for a transitional chinese locale... (cached) none checking for a french Unicode locale... (cached) none checking for a traditional french locale... (cached) none checking for a french Unicode locale... (cached) none checking for a traditional japanese locale... (cached) none checking for a transitional chinese locale... (cached) none checking for mmap... (cached) yes checking for MAP_ANONYMOUS... yes checking for mmap... (cached) yes checking for MAP_ANONYMOUS... yes checking for mmap... (cached) yes checking for MAP_ANONYMOUS... yes checking for library containing nanosleep... none required checking for working nanosleep... yes checking for getppriv... no checking whether program_invocation_name is declared... yes checking whether program_invocation_short_name is declared... yes checking for putenv compatible with GNU and SVID... yes checking for mmap... (cached) yes checking for MAP_ANONYMOUS... yes checking for mmap... (cached) yes checking for MAP_ANONYMOUS... yes checking whether rmdir works... yes checking for a traditional french locale... (cached) none checking for a french Unicode locale... (cached) none checking for a traditional japanese locale... (cached) none checking for a transitional chinese locale... (cached) none checking for struct sigaction.sa_sigaction... yes checking for sigprocmask... (cached) yes checking for mmap... (cached) yes checking for MAP_ANONYMOUS... yes checking whether <sys/ioctl.h> declares ioctl... yes checking whether ioctl is declared without a macro... yes checking for pthread_atfork... yes checking whether unlink honors trailing slashes... yes checking whether unlink of a parent directory fails as it should... guessing yes checking for unsetenv... yes checking for unsetenv() return type... int checking whether unsetenv obeys POSIX... yes checking whether mbrtowc handles incomplete characters... (cached) guessing yes checking whether mbrtowc works as well as mbtowc... (cached) guessing yes checking whether wcrtomb return value is correct... guessing yes checking for a traditional french locale... (cached) none checking for a french Unicode locale... (cached) none checking for a traditional japanese locale... (cached) none checking for a transitional chinese locale... (cached) none checking whether wctob works... guessing yes checking whether wctob is declared... (cached) yes checking for sched_yield in -lrt... yes checking how to print strings... printf checking for a sed that does not truncate output... (cached) /bin/sed checking for fgrep... /bin/grep -F checking for ld used by gcc -std=gnu99... /usr/bin/ld checking if the linker (/usr/bin/ld) is GNU ld... yes checking for BSD- or MS-compatible name lister (nm)... /usr/bin/nm -B checking the name lister (/usr/bin/nm -B) interface... BSD nm checking whether ln -s works... yes checking the maximum length of command line arguments... 1572864 checking whether the shell understands some XSI constructs... yes checking whether the shell understands "+="... yes checking how to convert powerpc64-unknown-linux-gnu file names to powerpc64-unknown-linux-gnu format... func_convert_file_noop checking how to convert powerpc64-unknown-linux-gnu file names to toolchain format... func_convert_file_noop checking for /usr/bin/ld option to reload object files... -r checking for objdump... objdump checking how to recognize dependent libraries... pass_all checking for dlltool... no checking how to associate runtime and link libraries... printf %s\n checking for archiver @FILE support... @ checking for strip... strip checking for ranlib... (cached) ranlib checking command to parse /usr/bin/nm -B output from gcc -std=gnu99 object... ok checking for sysroot... no checking for mt... mt checking if mt is a manifest tool... no checking for dlfcn.h... yes checking for objdir... .libs checking if gcc -std=gnu99 supports -fno-rtti -fno-exceptions... no checking for gcc -std=gnu99 option to produce PIC... -fPIC -DPIC checking if gcc -std=gnu99 PIC flag -fPIC -DPIC works... yes checking if gcc -std=gnu99 static flag -static works... yes checking if gcc -std=gnu99 supports -c -o file.o... yes checking if gcc -std=gnu99 supports -c -o file.o... (cached) yes checking whether the gcc -std=gnu99 linker (/usr/bin/ld -m elf32ppclinux) supports shared libraries... yes checking whether -lc should be explicitly linked in... no checking dynamic linker characteristics... GNU/Linux ld.so checking how to hardcode library paths into programs... immediate checking whether stripping libraries is possible... yes checking if libtool supports shared libraries... yes checking whether to build shared libraries... yes checking whether to build static libraries... yes checking whether ln -s works... yes checking for a sed that does not truncate output... (cached) /bin/sed checking for gcc -std=gnu99 option to accept ISO C99... (cached) -std=gnu99 checking for gcc -std=gnu99 -std=gnu99 option to accept ISO Standard C... (cached) -std=gnu99 checking how to run the C preprocessor... gcc -E checking for function prototypes... yes checking for special C compiler options needed for large files... (cached) no checking for _FILE_OFFSET_BITS value needed for large files... (cached) 64 checking size of long... 4 checking if __attribute__((cleanup(...))) works with this compiler... yes checking for dirent.h that defines DIR... yes checking for library containing opendir... none required checking for struct dirent.d_type... yes checking for struct stat.st_blocks... yes checking for struct stat.st_blksize... yes checking whether program_invocation_short_name is declared... (cached) yes checking attr/xattr.h usability... yes checking attr/xattr.h presence... yes checking for attr/xattr.h... yes checking for byteswap.h... (cached) yes checking endian.h usability... yes checking endian.h presence... yes checking for endian.h... yes checking errno.h usability... yes checking errno.h presence... yes checking for errno.h... yes checking linux/fs.h usability... yes checking linux/fs.h presence... yes checking for linux/fs.h... yes checking linux/raid/md_u.h usability... yes checking linux/raid/md_u.h presence... yes checking for linux/raid/md_u.h... yes checking printf.h usability... yes checking printf.h presence... yes checking for printf.h... yes checking sys/inotify.h usability... yes checking sys/inotify.h presence... yes checking for sys/inotify.h... yes checking for sys/socket.h... (cached) yes checking sys/statvfs.h usability... yes checking sys/statvfs.h presence... yes checking for sys/statvfs.h... yes checking for sys/types.h... (cached) yes checking sys/un.h usability... yes checking sys/un.h presence... yes checking for sys/un.h... yes checking for sys/wait.h... (cached) yes checking windows.h usability... no checking windows.h presence... no checking for windows.h... no checking sys/xattr.h usability... yes checking sys/xattr.h presence... yes checking for sys/xattr.h... yes checking for be32toh... no checking for fsync... yes checking for futimens... (cached) yes checking for getxattr... yes checking for htonl... yes checking for htons... yes checking for inotify_init1... yes checking for lgetxattr... yes checking for listxattr... yes checking for llistxattr... yes checking for lsetxattr... yes checking for lremovexattr... yes checking for mknod... yes checking for ntohl... yes checking for ntohs... yes checking for posix_fallocate... yes checking for posix_fadvise... yes checking for realpath... yes checking for removexattr... yes checking for setitimer... yes checking for setxattr... yes checking for sigaction... (cached) yes checking for statvfs... yes checking for sync... yes checking for tgetent in -lncurses... yes checking for tputs in -lncurses... yes checking for UP in -lncurses... yes checking for xgettext... no checking for msgcat... no checking for msgfmt... no checking for msgmerge... no checking msgfmt is GNU tool... no checking if we should build the daemon... yes checking if we should install the daemon... no checking if we should run the daemon under valgrind... no checking which of /sbin /usr/sbin /bin /usr/bin is a real directory... /sbin checking for register_printf_specifier... yes checking if we should build the appliance... yes checking for supermin... /usr/bin/supermin checking for --with-supermin-packager-config option... not set checking for --with-supermin-extra-options option... not set checking supermin is new enough... 5.1 checking which Linux distro for package names... UBUNTU checking for rpcgen... rpcgen checking for xdrmem_create in -lportablexdr... no checking for library containing xdrmem_create... none required checking for library containing xdr_u_int64_t... no checking for library containing xdr_uint64_t... none required checking selinux/selinux.h usability... yes checking selinux/selinux.h presence... yes checking for selinux/selinux.h... yes checking for setexeccon in -lselinux... yes checking for setcon... yes checking for getcon... yes checking sys/sdt.h usability... no checking sys/sdt.h presence... no checking for sys/sdt.h... no checking for cpio... cpio checking for gperf... gperf checking for perl... perl checking for Pod::Man... yes checking for Pod::Simple... yes checking for genisoimage... /usr/bin/genisoimage checking for xmllint... no checking for po4a... no checking for db_dump... no checking for db5.1_dump... no checking for db4_dump... no checking for db4.8_dump... no checking for db4.7_dump... no checking for db4.6_dump... no checking for db_load... no checking for db5.1_load... no checking for db4_load... no checking for db4.8_load... no checking for db4.7_load... no checking for db4.6_load... no checking for pbmtext... no checking for pnmtopng... no checking for bmptopnm... no checking for pamcut... no checking for wrestool... no checking for xzcat... /usr/bin/xzcat checking for pkg-config... /usr/bin/pkg-config checking pkg-config is at least version 0.9.0... yes checking for LIBLZMA... yes checking for lzma_index_stream_flags... yes checking for lzma_index_stream_padding... yes checking for flex... flex checking lex output file root... lex.yy checking lex library... -lfl checking whether yytext is a pointer... yes checking for bison... bison -y checking for qemu-kvm... no checking for kvm... /usr/bin/kvm checking if the user specified extra options for qemu command line... no checking that /usr/bin/kvm -help works... yes checking that /usr/bin/kvm -version works... yes checking for /usr/bin/kvm version >= 1... yes checking what extra options we need to use for qemu feature tests... -machine accel=kvm:tcg -display none checking that /usr/bin/kvm -machine accel=kvm:tcg -display none -device ? works... yes checking for virtio-serial support in /usr/bin/kvm... yes checking for main in -lreadline... no checking for append_history... no checking for completion_matches... no checking for rl_completion_matches... no checking for PCRE... yes checking for AUGEAS... yes checking for magic_file in -lmagic... yes checking magic.h usability... yes checking magic.h presence... yes checking for magic.h... yes checking for acl_from_text in -lacl... yes checking sys/acl.h usability... yes checking sys/acl.h presence... yes checking for sys/acl.h... yes checking for cap_from_text in -lcap... yes checking sys/capability.h usability... yes checking sys/capability.h presence... yes checking for sys/capability.h... yes checking for LIBVIRT... yes checking for LIBXML2... yes checking for xmlBufferDetach... yes checking for LIBCONFIG... yes checking for HIVEX... yes checking for SD_JOURNAL... yes checking for FUSE... yes checking for fuse_opt_add_opt_escaped... yes checking for YAJL... yes checking for g++... g++ checking whether we are using the GNU C++ compiler... yes checking whether g++ accepts -g... yes checking dependency style of g++... gcc3 checking how to run the C++ preprocessor... g++ -E checking for ld used by g++... /usr/bin/ld -m elf32ppclinux checking if the linker (/usr/bin/ld -m elf32ppclinux) is GNU ld... yes checking whether the g++ linker (/usr/bin/ld -m elf32ppclinux) supports shared libraries... yes checking for g++ option to produce PIC... -fPIC -DPIC checking if g++ PIC flag -fPIC -DPIC works... yes checking if g++ static flag -static works... yes checking if g++ supports -c -o file.o... yes checking if g++ supports -c -o file.o... (cached) yes checking whether the g++ linker (/usr/bin/ld -m elf32ppclinux) supports shared libraries... yes checking dynamic linker characteristics... (cached) GNU/Linux ld.so checking how to hardcode library paths into programs... immediate checking if the C++ compiler really really works... yes checking for valgrind... no checking for ocamlc... ocamlc OCaml version is 3.12.1 OCaml library path is /usr/lib/ocaml checking for ocamlopt... ocamlopt checking for ocamlc.opt... no checking for ocamlopt.opt... no checking for ocamldep... ocamldep checking for ocamlmktop... ocamlmktop checking for ocamlmklib... ocamlmklib checking for ocamldoc... ocamldoc checking for ocamlbuild... ocamlbuild checking for ocamlfind... no checking for caml/unixsupport.h... yes checking for OCaml findlib package gettext... not found configure: creating mllib/common_gettext.ml checking for ocaml-gettext... no checking for Test::More... yes checking for ExtUtils::MakeMaker... yes checking for python... python checking Python version... 2.7 checking for PYTHON... yes checking Python prefix... /usr checking for Python site-packages path... /usr/lib/python2.7/dist-packages checking for Python extension suffix (PEP-3149)... .so checking for PyCapsule_New in -lc... yes checking for PyString_AsString in -lc... yes checking for ruby... ruby checking for rake... no checking for C library for Ruby extensions... -lruby-1.9.1 checking for ruby_init in -lruby-1.9.1... no checking for ghc... no checking for php... php checking for phpize... no checking for erlc... /usr/bin/erlc checking for erl... /usr/bin/erl checking for Erlang/OTP 'erl_interface' library subdirectory... /usr/lib/erlang/lib/erl_interface-3.7.13 checking for Erlang/OTP 'erl_interface' library version... 3.7.13 checking for erlc... /usr/bin/erlc checking for erl... /usr/bin/erl checking for Erlang/OTP library base directory... /usr/lib/erlang/lib checking for lua... no checking for go... no checking for Pod::Usage... yes checking for Getopt::Long... yes checking for Sys::Virt... no checking for Locale::TextDomain... no checking for Win::Hivex... no checking for Win::Hivex::Regedit... no configure: WARNING: some Perl modules required to compile the Perl virt-* tools are missing checking for GOBJECT... yes checking for GIO... yes checking for gjs... gjs checking for gobject-introspection... no checking for gtkdoc-check... no checking for gtkdoc-rebase... no checking for gtkdoc-mkpdf... no checking whether to build gtk-doc documentation... no checking for BASH_COMPLETION... yes checking for bash-completions directory... /usr/share/bash-completion/completions checking if we should run the GNUlib tests... yes
checking that generated files are newer than configure... done configure: creating ./config.status
config.status: creating appliance/libguestfs-make-fixed-appliance config.status: creating inspector/test-xmllint.sh config.status: creating php/extension/php-for-tests.sh config.status: creating pick-guests.pl config.status: creating podwrapper.pl config.status: creating run config.status: creating Makefile config.status: creating align/Makefile config.status: creating appliance/Makefile config.status: creating bash/Makefile config.status: creating builder/Makefile config.status: creating builder/libguestfs.conf config.status: creating builder/test-config/virt-builder/repos.d/test-index.conf config.status: creating builder/test-website/virt-builder/repos.d/libguestfs.conf config.status: creating builder/website/Makefile config.status: creating cat/Makefile config.status: creating csharp/Makefile config.status: creating customize/Makefile config.status: creating daemon/Makefile config.status: creating df/Makefile config.status: creating diff/Makefile config.status: creating edit/Makefile config.status: creating erlang/Makefile config.status: creating erlang/examples/Makefile config.status: creating examples/Makefile config.status: creating fish/Makefile config.status: creating format/Makefile config.status: creating fuse/Makefile config.status: creating generator/Makefile config.status: creating gnulib/lib/Makefile config.status: creating gnulib/tests/Makefile config.status: creating gobject/libguestfs-gobject-1.0.pc config.status: creating gobject/Makefile config.status: creating gobject/docs/Makefile config.status: creating gobject/docs/guestfs-docs.sgml config.status: creating golang/Makefile config.status: creating golang/examples/Makefile config.status: creating haskell/Makefile config.status: creating inspector/Makefile config.status: creating java/Makefile config.status: creating java/examples/Makefile config.status: creating lua/Makefile config.status: creating lua/examples/Makefile config.status: creating make-fs/Makefile config.status: creating mllib/Makefile config.status: creating mllib/config.ml config.status: creating ocaml/META config.status: creating ocaml/Makefile config.status: creating ocaml/examples/Makefile config.status: creating perl/Makefile config.status: creating perl/Makefile.PL config.status: creating perl/examples/Makefile config.status: creating php/Makefile config.status: creating po-docs/Makefile config.status: creating po-docs/ja/Makefile config.status: creating po-docs/uk/Makefile config.status: creating po/Makefile config.status: creating python/Makefile config.status: creating python/examples/Makefile config.status: creating rescue/Makefile config.status: creating resize/Makefile config.status: creating ruby/Makefile config.status: creating ruby/Rakefile config.status: creating ruby/examples/Makefile config.status: creating ruby/ext/guestfs/extconf.rb config.status: creating sparsify/Makefile config.status: creating src/Makefile config.status: creating src/libguestfs.pc config.status: creating sysprep/Makefile config.status: creating test-tool/Makefile config.status: creating tests/9p/Makefile config.status: creating tests/bigdirs/Makefile config.status: creating tests/btrfs/Makefile config.status: creating tests/c-api/Makefile config.status: creating tests/charsets/Makefile config.status: creating tests/create/Makefile config.status: creating tests/data/Makefile config.status: creating tests/discard/Makefile config.status: creating tests/disks/Makefile config.status: creating tests/disks/test-qemu-drive-libvirt.xml config.status: creating tests/disk-labels/Makefile config.status: creating tests/events/Makefile config.status: creating tests/fuzz/Makefile config.status: creating tests/guests/Makefile config.status: creating tests/guests/guests.xml config.status: creating tests/hotplug/Makefile config.status: creating tests/http/Makefile config.status: creating tests/journal/Makefile config.status: creating tests/luks/Makefile config.status: creating tests/lvm/Makefile config.status: creating tests/md/Makefile config.status: creating tests/mount-local/Makefile config.status: creating tests/mountable/Makefile config.status: creating tests/nbd/Makefile config.status: creating tests/network/Makefile config.status: creating tests/ntfsclone/Makefile config.status: creating tests/parallel/Makefile config.status: creating tests/protocol/Makefile config.status: creating tests/qemu/Makefile config.status: creating tests/regressions/Makefile config.status: creating tests/relative-paths/Makefile config.status: creating tests/rsync/Makefile config.status: creating tests/selinux/Makefile config.status: creating tests/syslinux/Makefile config.status: creating tests/tmpdirs/Makefile config.status: creating tests/xfs/Makefile config.status: creating tests/xml/Makefile config.status: creating tools/Makefile config.status: creating config.h config.status: executing depfiles commands config.status: executing libtool commands
------------------------------------------------------------ Thank you for downloading libguestfs 1.26.1
This is how we have configured the optional components for you today:
Daemon .............................. yes Appliance ........................... yes QEMU ................................ /usr/bin/kvm guestfish and C-based virt tools .... yes FUSE filesystem ..................... yes GNU gettext for i18n ................ no OCaml bindings ...................... no OCaml-based virt tools .............. no Perl bindings ....................... yes Perl-based virt tools ............... no Python bindings ..................... yes Ruby bindings ....................... no Java bindings ....................... no Haskell bindings .................... no PHP bindings ........................ no Erlang bindings ..................... yes Lua bindings ........................ no Go bindings ......................... no gobject bindings .................... yes gobject introspection ............... no bash completion ..................... yes
If any optional component is configured 'no' when you expected 'yes' then you should check the preceding messages.
Please report bugs back to the mailing list: http://www.redhat.com/mailman/listinfo/libguestfs
Next you should type 'make' to build the package, then 'make check' to run the tests.
Or run 'make help' to list some common targets.
On Thu, May 29, 2014 at 9:27 PM, Richard W.M. Jones <rjones@redhat.com> wrote:
On Thu, May 29, 2014 at 09:23:56PM +0530, abhishek jain wrote:
Hi Rich
Yes Rich I have tried libguesftfs on powerpc and it was working fine.For some reason i had to format my hard disk and now when I'm again compiling it,I'm getting following error....
Below is the status of configure ..
This is how we have configured the optional components for you today:
Daemon .............................. yes Appliance ........................... yes
I need to see the entire output of configure.
You could also do:
make V=1
and add all of that output too.
Rich.
-- Richard Jones, Virtualization Group, Red Hat http://people.redhat.com/~rjones Read my programming and virtualization blog: http://rwmj.wordpress.com virt-df lists disk usage of guests without needing to install any software inside the virtual machine. Supports Linux and Windows. http://people.redhat.com/~rjones/virt-df/
On Thu, May 29, 2014 at 09:30:45PM +0530, abhishek jain wrote: [...]
checking for main in -lreadline... no checking for append_history... no checking for completion_matches... no checking for rl_completion_matches... no
OK here's your problem. You need to install libreadline-dev and rerun configure. Rich. -- Richard Jones, Virtualization Group, Red Hat http://people.redhat.com/~rjones Read my programming and virtualization blog: http://rwmj.wordpress.com virt-p2v converts physical machines to virtual machines. Boot with a live CD or over the network (PXE) and turn machines into KVM guests. http://libguestfs.org/virt-v2v
Glad Buddy.:-) It worked. Thanks a lot. I'm having some urgent deliverable and this would really help me alot. Thanks again. Would love to trouble you again . On Thu, May 29, 2014 at 9:34 PM, Richard W.M. Jones <rjones@redhat.com> wrote:
On Thu, May 29, 2014 at 09:30:45PM +0530, abhishek jain wrote: [...]
checking for main in -lreadline... no checking for append_history... no checking for completion_matches... no checking for rl_completion_matches... no
OK here's your problem.
You need to install libreadline-dev and rerun configure.
Rich.
-- Richard Jones, Virtualization Group, Red Hat http://people.redhat.com/~rjones Read my programming and virtualization blog: http://rwmj.wordpress.com virt-p2v converts physical machines to virtual machines. Boot with a live CD or over the network (PXE) and turn machines into KVM guests. http://libguestfs.org/virt-v2v
Hi Rich One more quiry. When I'm trying to execute the binary on the powerpc ubuntu, it gives /usr/bin/supermin error.However it works fine on x86 ubuntu.Below are the logs... PATH=/bin:/sbin:/bin:/sbin:/usr/bin:/usr/sbin:/usr/local/sbin:/usr/local/bin SELinux: sh: getenforce: command not found guestfs_get_append: (null) guestfs_get_autosync: 1 guestfs_get_backend: direct guestfs_get_backend_settings: [] guestfs_get_cachedir: /var/tmp guestfs_get_direct: 0 guestfs_get_hv: /usr/bin/kvm guestfs_get_memsize: 768 guestfs_get_network: 0 guestfs_get_path: /usr/local/lib/guestfs guestfs_get_pgroup: 0 guestfs_get_program: libguestfs-test-tool guestfs_get_recovery_proc: 1 guestfs_get_selinux: 0 guestfs_get_smp: 1 guestfs_get_tmpdir: /tmp guestfs_get_trace: 0 guestfs_get_verbose: 1 host_cpu: powerpc64 Launching appliance, timeout set to 600 seconds. libguestfs: launch: program=libguestfs-test-tool libguestfs: launch: version=1.26.1 libguestfs: launch: backend registered: unix libguestfs: launch: backend registered: uml libguestfs: launch: backend registered: direct libguestfs: launch: backend=direct libguestfs: launch: tmpdir=/tmp/libguestfsvnUxG2 libguestfs: launch: umask=0002 libguestfs: launch: euid=1000 libguestfs: [00000ms] begin building supermin appliance libguestfs: [00000ms] run supermin libguestfs: command: run: /usr/bin/supermin libguestfs: command: run: \ --build libguestfs: command: run: \ --verbose libguestfs: command: run: \ --if-newer libguestfs: command: run: \ --lock /var/tmp/.guestfs-1000/lock libguestfs: command: run: \ --copy-kernel libguestfs: command: run: \ -f ext2 libguestfs: command: run: \ --host-cpu powerpc64 libguestfs: command: run: \ /usr/local/lib/guestfs/supermin.d libguestfs: command: run: \ -o /var/tmp/.guestfs-1000/appliance.d supermin: version: 5.1.8 supermin: package handler: debian/dpkg supermin: acquiring lock on /var/tmp/.guestfs-1000/lock supermin: build: /usr/local/lib/guestfs/supermin.d supermin: build: visiting /usr/local/lib/guestfs/supermin.d/base.tar.gz type gzip base image (tar) supermin: build: visiting /usr/local/lib/guestfs/supermin.d/daemon.tar.gz type gzip base image (tar) supermin: build: visiting /usr/local/lib/guestfs/supermin.d/excludefiles type uncompressed excludefiles supermin: build: visiting /usr/local/lib/guestfs/supermin.d/hostfiles type uncompressed hostfiles supermin: build: visiting /usr/local/lib/guestfs/supermin.d/init.tar.gz type gzip base image (tar) supermin: build: visiting /usr/local/lib/guestfs/supermin.d/packages type uncompressed packages supermin: build: visiting /usr/local/lib/guestfs/supermin.d/udev-rules.tar.gz type gzip base image (tar) supermin: build: 121 packages, including dependencies supermin: build: 7109 files supermin: build: 7109 files, after removing unreadable files supermin: build: 4939 files, after matching excludefiles supermin: build: 4941 files, after adding hostfiles supermin: build: 4944 files, after munging supermin: failed to find a suitable kernel (host_cpu=powerpc64). I looked for kernels in /boot and modules in /lib/modules. If this is a Xen guest, and you only have Xen domU kernels installed, try installing a fullvirt kernel (only for supermin use, you shouldn't boot the Xen guest with it). libguestfs: error: /usr/bin/supermin exited with error status 1, see debug messages above libguestfs-test-tool: failed to launch appliance libguestfs: closing guestfs handle 0x10016848 (state 0) libguestfs: command: run: rm libguestfs: command: run: \ -rf /tmp/libguestfsvnUxG2 Also while compiling libguesfs for powerpc ubuntu,it required supermin_5.1.8-2_powerpc.deb package . Please help regarding this. Thanks On Thu, May 29, 2014 at 9:57 PM, abhishek jain <ashujain9727@gmail.com> wrote:
Glad Buddy.:-)
It worked. Thanks a lot.
I'm having some urgent deliverable and this would really help me alot.
Thanks again.
Would love to trouble you again .
On Thu, May 29, 2014 at 9:34 PM, Richard W.M. Jones <rjones@redhat.com> wrote:
On Thu, May 29, 2014 at 09:30:45PM +0530, abhishek jain wrote: [...]
checking for main in -lreadline... no checking for append_history... no checking for completion_matches... no checking for rl_completion_matches... no
OK here's your problem.
You need to install libreadline-dev and rerun configure.
Rich.
-- Richard Jones, Virtualization Group, Red Hat http://people.redhat.com/~rjones Read my programming and virtualization blog: http://rwmj.wordpress.com virt-p2v converts physical machines to virtual machines. Boot with a live CD or over the network (PXE) and turn machines into KVM guests. http://libguestfs.org/virt-v2v
On Sat, May 31, 2014 at 03:01:47PM +0530, abhishek jain wrote:
/usr/local/lib/guestfs/supermin.d/udev-rules.tar.gz type gzip base image (tar) supermin: build: 121 packages, including dependencies supermin: build: 7109 files supermin: build: 7109 files, after removing unreadable files supermin: build: 4939 files, after matching excludefiles supermin: build: 4941 files, after adding hostfiles supermin: build: 4944 files, after munging supermin: failed to find a suitable kernel (host_cpu=powerpc64).
I looked for kernels in /boot and modules in /lib/modules.
If this is a Xen guest, and you only have Xen domU kernels installed, try installing a fullvirt kernel (only for supermin use, you shouldn't boot the Xen guest with it). libguestfs: error: /usr/bin/supermin exited with error status 1, see debug messages above libguestfs-test-tool: failed to launch appliance libguestfs: closing guestfs handle 0x10016848 (state 0) libguestfs: command: run: rm libguestfs: command: run: \ -rf /tmp/libguestfsvnUxG2
This is actually a bug in supermin. However I think it is fixed in recent supermin. Have a look at the patt_of_cpu function here: https://github.com/libguestfs/supermin/blob/master/src/kernel.ml#L26 This was added by Hilko's patch: https://github.com/libguestfs/supermin/commit/e8dd485a1737da365bc6af4afb5945... and I suspect you will need to include this patch in your version of supermin. You'll have to also look at the contents of /boot. Note also that you don't need to install the supermin package in order to use it, if you follow the instructions here: http://libguestfs.org/guestfs-faq.1.html#how-can-i-compile-and-install-libgu... Rich. -- Richard Jones, Virtualization Group, Red Hat http://people.redhat.com/~rjones Read my programming and virtualization blog: http://rwmj.wordpress.com Fedora Windows cross-compiler. Compile Windows programs, test, and build Windows installers. Over 100 libraries supported. http://fedoraproject.org/wiki/MinGW
Hi Rich Thanks for the quick response. I'll test and let you know the result. On Sat, May 31, 2014 at 4:12 PM, Richard W.M. Jones <rjones@redhat.com> wrote:
On Sat, May 31, 2014 at 03:01:47PM +0530, abhishek jain wrote:
/usr/local/lib/guestfs/supermin.d/udev-rules.tar.gz type gzip base image (tar) supermin: build: 121 packages, including dependencies supermin: build: 7109 files supermin: build: 7109 files, after removing unreadable files supermin: build: 4939 files, after matching excludefiles supermin: build: 4941 files, after adding hostfiles supermin: build: 4944 files, after munging supermin: failed to find a suitable kernel (host_cpu=powerpc64).
I looked for kernels in /boot and modules in /lib/modules.
If this is a Xen guest, and you only have Xen domU kernels installed, try installing a fullvirt kernel (only for supermin use, you shouldn't boot the Xen guest with it). libguestfs: error: /usr/bin/supermin exited with error status 1, see debug messages above libguestfs-test-tool: failed to launch appliance libguestfs: closing guestfs handle 0x10016848 (state 0) libguestfs: command: run: rm libguestfs: command: run: \ -rf /tmp/libguestfsvnUxG2
This is actually a bug in supermin. However I think it is fixed in recent supermin.
Have a look at the patt_of_cpu function here:
https://github.com/libguestfs/supermin/blob/master/src/kernel.ml#L26
This was added by Hilko's patch:
https://github.com/libguestfs/supermin/commit/e8dd485a1737da365bc6af4afb5945...
and I suspect you will need to include this patch in your version of supermin. You'll have to also look at the contents of /boot.
Note also that you don't need to install the supermin package in order to use it, if you follow the instructions here:
http://libguestfs.org/guestfs-faq.1.html#how-can-i-compile-and-install-libgu...
Rich.
-- Richard Jones, Virtualization Group, Red Hat http://people.redhat.com/~rjones Read my programming and virtualization blog: http://rwmj.wordpress.com Fedora Windows cross-compiler. Compile Windows programs, test, and build Windows installers. Over 100 libraries supported. http://fedoraproject.org/wiki/MinGW
Hi Rich One more quiry. After installing libguestfs-test-tool on my powerpc ubuntu,I'm getting this following error on my system ... UnsupportedRpcVersion: Specified RPC version, 3.23, not supported by this endpoint. Can you help regarding this? Thanks On Sat, May 31, 2014 at 4:18 PM, abhishek jain <ashujain9727@gmail.com> wrote:
Hi Rich
Thanks for the quick response.
I'll test and let you know the result.
On Sat, May 31, 2014 at 4:12 PM, Richard W.M. Jones <rjones@redhat.com> wrote:
On Sat, May 31, 2014 at 03:01:47PM +0530, abhishek jain wrote:
/usr/local/lib/guestfs/supermin.d/udev-rules.tar.gz type gzip base image (tar) supermin: build: 121 packages, including dependencies supermin: build: 7109 files supermin: build: 7109 files, after removing unreadable files supermin: build: 4939 files, after matching excludefiles supermin: build: 4941 files, after adding hostfiles supermin: build: 4944 files, after munging supermin: failed to find a suitable kernel (host_cpu=powerpc64).
I looked for kernels in /boot and modules in /lib/modules.
If this is a Xen guest, and you only have Xen domU kernels installed, try installing a fullvirt kernel (only for supermin use, you shouldn't boot the Xen guest with it). libguestfs: error: /usr/bin/supermin exited with error status 1, see debug messages above libguestfs-test-tool: failed to launch appliance libguestfs: closing guestfs handle 0x10016848 (state 0) libguestfs: command: run: rm libguestfs: command: run: \ -rf /tmp/libguestfsvnUxG2
This is actually a bug in supermin. However I think it is fixed in recent supermin.
Have a look at the patt_of_cpu function here:
https://github.com/libguestfs/supermin/blob/master/src/kernel.ml#L26
This was added by Hilko's patch:
https://github.com/libguestfs/supermin/commit/e8dd485a1737da365bc6af4afb5945...
and I suspect you will need to include this patch in your version of supermin. You'll have to also look at the contents of /boot.
Note also that you don't need to install the supermin package in order to use it, if you follow the instructions here:
http://libguestfs.org/guestfs-faq.1.html#how-can-i-compile-and-install-libgu...
Rich.
-- Richard Jones, Virtualization Group, Red Hat http://people.redhat.com/~rjones Read my programming and virtualization blog: http://rwmj.wordpress.com Fedora Windows cross-compiler. Compile Windows programs, test, and build Windows installers. Over 100 libraries supported. http://fedoraproject.org/wiki/MinGW
On Mon, Jun 02, 2014 at 07:10:49PM +0530, abhishek jain wrote:
Hi Rich
One more quiry. After installing libguestfs-test-tool on my powerpc ubuntu,I'm getting this following error on my system ...
UnsupportedRpcVersion: Specified RPC version, 3.23, not supported by this endpoint.
Can you help regarding this?
I really need to see the complete, unedited output of libguestfs-test-tool, and / or the command that produced this error. Isolated error messages are not very useful. Rich.
Thanks
On Sat, May 31, 2014 at 4:18 PM, abhishek jain <ashujain9727@gmail.com> wrote:
Hi Rich
Thanks for the quick response.
I'll test and let you know the result.
On Sat, May 31, 2014 at 4:12 PM, Richard W.M. Jones <rjones@redhat.com> wrote:
On Sat, May 31, 2014 at 03:01:47PM +0530, abhishek jain wrote:
/usr/local/lib/guestfs/supermin.d/udev-rules.tar.gz type gzip base image (tar) supermin: build: 121 packages, including dependencies supermin: build: 7109 files supermin: build: 7109 files, after removing unreadable files supermin: build: 4939 files, after matching excludefiles supermin: build: 4941 files, after adding hostfiles supermin: build: 4944 files, after munging supermin: failed to find a suitable kernel (host_cpu=powerpc64).
I looked for kernels in /boot and modules in /lib/modules.
If this is a Xen guest, and you only have Xen domU kernels installed, try installing a fullvirt kernel (only for supermin use, you shouldn't boot the Xen guest with it). libguestfs: error: /usr/bin/supermin exited with error status 1, see debug messages above libguestfs-test-tool: failed to launch appliance libguestfs: closing guestfs handle 0x10016848 (state 0) libguestfs: command: run: rm libguestfs: command: run: \ -rf /tmp/libguestfsvnUxG2
This is actually a bug in supermin. However I think it is fixed in recent supermin.
Have a look at the patt_of_cpu function here:
https://github.com/libguestfs/supermin/blob/master/src/kernel.ml#L26
This was added by Hilko's patch:
https://github.com/libguestfs/supermin/commit/e8dd485a1737da365bc6af4afb5945...
and I suspect you will need to include this patch in your version of supermin. You'll have to also look at the contents of /boot.
Note also that you don't need to install the supermin package in order to use it, if you follow the instructions here:
http://libguestfs.org/guestfs-faq.1.html#how-can-i-compile-and-install-libgu...
Rich.
-- Richard Jones, Virtualization Group, Red Hat http://people.redhat.com/~rjones Read my programming and virtualization blog: http://rwmj.wordpress.com Fedora Windows cross-compiler. Compile Windows programs, test, and build Windows installers. Over 100 libraries supported. http://fedoraproject.org/wiki/MinGW
-- Richard Jones, Virtualization Group, Red Hat http://people.redhat.com/~rjones Read my programming and virtualization blog: http://rwmj.wordpress.com virt-p2v converts physical machines to virtual machines. Boot with a live CD or over the network (PXE) and turn machines into KVM guests. http://libguestfs.org/virt-v2v
Hi Rich I'm running openstack compute node on powerpc ubuntu 13.10 and openstack controller node on ubuntu x86 machine.Initially when I tried booting VM from controller node onto powerpc compute node,the nova-compute service which is responsible for booting VM on compute node was searching for libguestfs-test-tool.After compiling linguesftfs for powerpc,the nova-compute resulted in the supermin error as discussed with you earlier.The VM at compute node was stucking at spawning state at that moment. The libguestfs-test-tool compilation required following packages to be installed on powerpc ubuntu ... sudo apt-get install libncurses5-dev gperf flex pkg-config aptitude erlang-dev libxml2-dev libgnutls-dev libdevmapper-dev libcurl4-gnutls-dev python-dev libpciaccess-dev libnl-dev gcc make libreadline-dev libglib2.0-dev rsyslog libtool apt-utils bison libaugeas-dev autoconf However when I'm trying to again boot VM from controller node onto compute node,the nova-compute service on compute node is displaying following error.. Traceback (most recent call last):^M 2014-06-02 08:58:18.783 24773 TRACE nova.openstack.common.rpc.amqp File "/opt/stack/nova/nova/openstack/common/rpc/amqp.py", line 461, in _process_data^M 2014-06-02 08:58:18.783 24773 TRACE nova.openstack.common.rpc.amqp **args)^M 2014-06-02 08:58:18.783 24773 TRACE nova.openstack.common.rpc.amqp File "/opt/stack/nova/nova/openstack/common/rpc/dispatcher.py", line 178, in dispatch^M 2014-06-02 08:58:18.783 24773 TRACE nova.openstack.common.rpc.amqp raise rpc_common.UnsupportedRpcVersion(version=version)^M 2014-06-02 08:58:18.783 24773 TRACE nova.openstack.common.rpc.amqp UnsupportedRpcVersion: Specified RPC version, 3.23, not supported by this endpoint.^M 2014-06-02 08:58:18.783 24773 TRACE nova.openstack.common.rpc.amqp ^M 2014-06-02 08:58:23.907 24773 DEBUG nova.openstack.common.rpc.amqp [-] Making synchronous call on conductor ... multicall /opt/stack/nova/nova/openstack/common/rpc/amqp.py:553^M 2014-06-02 08:58:23.908 24773 DEBUG nova.openstack.common.rpc.amqp [-] MSG_ID is e4d4ee738c9f404592f63db7f70154fa multicall /opt/stack/nova/nova The VM is now not even spawning . Can you help regarding this? Thanks for the support.
Hi, On Monday 02 June 2014 19:42:14 abhishek jain wrote:
However when I'm trying to again boot VM from controller node onto compute node,the nova-compute service on compute node is displaying following error..
Traceback (most recent call last):^M 2014-06-02 08:58:18.783 24773 TRACE nova.openstack.common.rpc.amqp File "/opt/stack/nova/nova/openstack/common/rpc/amqp.py", line 461, in _process_data^M 2014-06-02 08:58:18.783 24773 TRACE nova.openstack.common.rpc.amqp **args)^M 2014-06-02 08:58:18.783 24773 TRACE nova.openstack.common.rpc.amqp File "/opt/stack/nova/nova/openstack/common/rpc/dispatcher.py", line 178, in dispatch^M 2014-06-02 08:58:18.783 24773 TRACE nova.openstack.common.rpc.amqp raise rpc_common.UnsupportedRpcVersion(version=version)^M 2014-06-02 08:58:18.783 24773 TRACE nova.openstack.common.rpc.amqp UnsupportedRpcVersion: Specified RPC version, 3.23, not supported by this endpoint.^M 2014-06-02 08:58:18.783 24773 TRACE nova.openstack.common.rpc.amqp ^M 2014-06-02 08:58:23.907 24773 DEBUG nova.openstack.common.rpc.amqp [-] Making synchronous call on conductor ... multicall /opt/stack/nova/nova/openstack/common/rpc/amqp.py:553^M 2014-06-02 08:58:23.908 24773 DEBUG nova.openstack.common.rpc.amqp [-] MSG_ID is e4d4ee738c9f404592f63db7f70154fa multicall /opt/stack/nova/nova
This sounds like it is some issue related to AMQP, and you should look at even more lines before the ones you pasted to find out the full Python stack trace and other error messages. -- Pino Toscano
Hi Pino Thanks. I'll test and let you know if any further problems, On Mon, Jun 2, 2014 at 8:04 PM, Pino Toscano <ptoscano@redhat.com> wrote:
Hi,
On Monday 02 June 2014 19:42:14 abhishek jain wrote:
However when I'm trying to again boot VM from controller node onto compute node,the nova-compute service on compute node is displaying following error..
Traceback (most recent call last):^M 2014-06-02 08:58:18.783 24773 TRACE nova.openstack.common.rpc.amqp File "/opt/stack/nova/nova/openstack/common/rpc/amqp.py", line 461, in _process_data^M 2014-06-02 08:58:18.783 24773 TRACE nova.openstack.common.rpc.amqp **args)^M 2014-06-02 08:58:18.783 24773 TRACE nova.openstack.common.rpc.amqp File "/opt/stack/nova/nova/openstack/common/rpc/dispatcher.py", line 178, in dispatch^M 2014-06-02 08:58:18.783 24773 TRACE nova.openstack.common.rpc.amqp raise rpc_common.UnsupportedRpcVersion(version=version)^M 2014-06-02 08:58:18.783 24773 TRACE nova.openstack.common.rpc.amqp UnsupportedRpcVersion: Specified RPC version, 3.23, not supported by this endpoint.^M 2014-06-02 08:58:18.783 24773 TRACE nova.openstack.common.rpc.amqp ^M 2014-06-02 08:58:23.907 24773 DEBUG nova.openstack.common.rpc.amqp [-] Making synchronous call on conductor ... multicall /opt/stack/nova/nova/openstack/common/rpc/amqp.py:553^M 2014-06-02 08:58:23.908 24773 DEBUG nova.openstack.common.rpc.amqp [-] MSG_ID is e4d4ee738c9f404592f63db7f70154fa multicall /opt/stack/nova/nova
This sounds like it is some issue related to AMQP, and you should look at even more lines before the ones you pasted to find out the full Python stack trace and other error messages.
-- Pino Toscano
Hi Pino,Rich I'm able to solve the above issue. Thanks On Mon, Jun 2, 2014 at 9:40 PM, abhishek jain <ashujain9727@gmail.com> wrote:
Hi Pino
Thanks. I'll test and let you know if any further problems,
On Mon, Jun 2, 2014 at 8:04 PM, Pino Toscano <ptoscano@redhat.com> wrote:
Hi,
On Monday 02 June 2014 19:42:14 abhishek jain wrote:
However when I'm trying to again boot VM from controller node onto compute node,the nova-compute service on compute node is displaying following error..
Traceback (most recent call last):^M 2014-06-02 08:58:18.783 24773 TRACE nova.openstack.common.rpc.amqp File "/opt/stack/nova/nova/openstack/common/rpc/amqp.py", line 461, in _process_data^M 2014-06-02 08:58:18.783 24773 TRACE nova.openstack.common.rpc.amqp **args)^M 2014-06-02 08:58:18.783 24773 TRACE nova.openstack.common.rpc.amqp File "/opt/stack/nova/nova/openstack/common/rpc/dispatcher.py", line 178, in dispatch^M 2014-06-02 08:58:18.783 24773 TRACE nova.openstack.common.rpc.amqp raise rpc_common.UnsupportedRpcVersion(version=version)^M 2014-06-02 08:58:18.783 24773 TRACE nova.openstack.common.rpc.amqp UnsupportedRpcVersion: Specified RPC version, 3.23, not supported by this endpoint.^M 2014-06-02 08:58:18.783 24773 TRACE nova.openstack.common.rpc.amqp ^M 2014-06-02 08:58:23.907 24773 DEBUG nova.openstack.common.rpc.amqp [-] Making synchronous call on conductor ... multicall /opt/stack/nova/nova/openstack/common/rpc/amqp.py:553^M 2014-06-02 08:58:23.908 24773 DEBUG nova.openstack.common.rpc.amqp [-] MSG_ID is e4d4ee738c9f404592f63db7f70154fa multicall /opt/stack/nova/nova
This sounds like it is some issue related to AMQP, and you should look at even more lines before the ones you pasted to find out the full Python stack trace and other error messages.
-- Pino Toscano
participants (3)
-
abhishek jain -
Pino Toscano -
Richard W.M. Jones